Acetonitrile, (2,6-dichlorophenyl)-
- Formula: C8H5Cl2N
- Molecular weight: 186.038
- IUPAC Standard InChIKey: AOEJUUCUKRUCEF-UHFFFAOYSA-N
- CAS Registry Number: 3215-64-3
- Chemical structure:
View 3d structure (requires JavaScript / HTML 5) - Other names: (2,6-Dichlorophenyl)acetonitrile; 2,6-Dichlorobenzeneacetonitrile; 2,6-Dichlorobenzyl cyanide; 2,6-Dichlorophenylacetic acid nitrile

Gas phase ion energetics data

Data compiled by: Henry M. Rosenstock, Keith Draxl, Bruce W. Steiner, and John T. Herron
Ionization energy determinations
IE (eV) | Method | Reference |
---|---|---|
9.73 ± 0.06 | EI | Buchs, 1970 |

References

Buchs, 1970
Buchs, A.,
Etude par spectrometrie de masse de l'ionisation de benzonitriles, de phenylacetonitriles et de N,N-dimethylanilines substitues,
Helv. Chim. Acta, 1970, 53, 2026. [all data]