1-Cyclopenten-3-ol
- Formula: C5H8O
- Molecular weight: 84.1164
- IUPAC Standard InChIKey: NWZXFAYYQNFDCA-UHFFFAOYSA-N
- CAS Registry Number: 3212-60-0
- Chemical structure:
View 3d structure (requires JavaScript / HTML 5) - Other names: cyclopent-2-en-1-ol; Cyclopenten-1-ol

Phase change data

Data compiled by: Thermodynamics Research Center, NIST Boulder Laboratories, Chris Muzny director
Quantity | Value | Units | Method | Reference | Comment |
---|---|---|---|---|---|
Tfus | 215.6 | K | N/A | Anonymous, 1957 | Uncertainty assigned by TRC = 0.6 K |

Gas phase ion energetics data

Data compiled by: Sharon G. Lias, Rhoda D. Levin, and Sherif A. Kafafi
Ionization energy determinations
IE (eV) | Method | Reference | Comment |
---|---|---|---|
9.60 ± 0.05 | PE | McAlduff, Caramella, et al., 1978 | Vertical value |

References

Anonymous, 1957
Anonymous, R.,
, Am. Pet. Inst. Res. Proj. 6, Carnegie-Mellon Univ., 1957. [all data]
McAlduff, Caramella, et al., 1978
McAlduff, E.J.; Caramella, P.; Houk, K.N.,
Photoelectron spectra of 3-substituted cyclopentenes. Correlations between ionization potentials and cycloaddition regioselectivity,
J. Am. Chem. Soc., 1978, 100, 105. [all data]