Hydrazine, (1,1-dimethylethyl)-
- Formula: C4H12N2
- Molecular weight: 88.1515
- IUPAC Standard InChIKey: MUQNAPSBHXFMHT-UHFFFAOYSA-N
- CAS Registry Number: 32064-67-8
- Chemical structure:
View 3d structure (requires JavaScript / HTML 5) - Other names: tert-Butylhydrazine

Gas phase ion energetics data

Data compiled by: Sharon G. Lias, Rhoda D. Levin, and Sherif A. Kafafi
Ionization energy determinations
IE (eV) | Method | Reference | Comment |
---|---|---|---|
8.92 | PE | Nelsen and Buschek, 1974 | Vertical value |

Normal alkane RI, non-polar column, temperature ramp

Column type | Active phase | I | Reference | Comment |
---|---|---|---|---|
Capillary | OV-101 | 736. | Zenkevich, 2005 | 25. m/0.20 mm/0.10 μm, N2/He, 6. K/min; Tstart: 50. C; Tend: 250. C |

References

Nelsen and Buschek, 1974
Nelsen, S.F.; Buschek, J.M.,
Photoelectron spectra of hydrazines. III. Evidence for similar lone pair-lone pair dihedral angles for acyclic hydrazines,
J. Am. Chem. Soc., 1974, 96, 2392. [all data]
Zenkevich, 2005
Zenkevich, I.G.,
Experimentally measured retention indices., 2005. [all data]