2-Propynenitrile, 3-fluoro-
- Formula: C3FN
- Molecular weight: 69.0372
- IUPAC Standard InChIKey: RBVSYFWRRIFVAC-UHFFFAOYSA-N
- CAS Registry Number: 32038-83-8
- Chemical structure:
View 3d structure (requires JavaScript / HTML 5) - Other names: CF≡CCN

Gas phase ion energetics data

Data compiled as indicated in comments:
LLK - Sharon G. Lias, Rhoda D. Levin, and Sherif A. Kafafi
Ionization energy determinations
IE (eV) | Method | Reference | Comment |
---|---|---|---|
11.51 ± 0.02 | PE | Bieri, Heilbronner, et al., 1979 | LLK |

References

Bieri, Heilbronner, et al., 1979
Bieri, G.; Heilbronner, E.; Hornung, V.; Kloster-Jensen, E.; Maier, J.P.; Thommen, F.; von Niessen, W.,
Electronic states of substituted haloacetylene and cyanoacetylene radical cations,
Chem. Phys., 1979, 36, 1. [all data]