Benzene, 1,3,5-trichloro-2,4,6-trifluoro-
- Formula: C6Cl3F3
- Molecular weight: 235.418
- IUPAC Standard InChIKey: QPXZZPSKCVNHFW-UHFFFAOYSA-N
- CAS Registry Number: 319-88-0
- Chemical structure:
View 3d structure (requires JavaScript / HTML 5) - Other names: 1,3,5-Trichloro-2,4,6-trifluorobenzene; 1,3,5-Trichlorotrifluorobenzene

Condensed phase thermochemistry data

Data compiled by: Eugene S. Domalski and Elizabeth D. Hearing
Quantity | Value | Units | Method | Reference | Comment |
---|---|---|---|---|---|
S°solid,1 bar | 58.15 | cal/mol*K | N/A | Andon and Martin, 1973 | |
S°solid,1 bar | 58.640 | cal/mol*K | N/A | Paukov and Glukhikh, 1969 |
Constant pressure heat capacity of solid
Cp,solid (cal/mol*K) | Temperature (K) | Reference | Comment |
---|---|---|---|
47.08 | 298.15 | Andon and Martin, 1973 | T = 14 to 347 K. |
47.311 | 298.15 | Paukov and Glukhikh, 1969 | T = 13 to 355 K. |

Phase change data

Data compiled as indicated in comments:
BS - Robert L. Brown and Stephen E. Stein
TRC - Thermodynamics Research Center, NIST Boulder Laboratories, Chris Muzny director
AC - William E. Acree, Jr., James S. Chickos
DH - Eugene S. Domalski and Elizabeth D. Hearing
Quantity | Value | Units | Method | Reference | Comment |
---|---|---|---|---|---|
Ttriple | 335.01 | K | N/A | Andon and Martin, 1973, 2 | Uncertainty assigned by TRC = 0.02 K; TRC |
Ttriple | 334.16 | K | N/A | Paukov and Glukhikh, 1969, 2 | Uncertainty assigned by TRC = 0.02 K; TRC |
Quantity | Value | Units | Method | Reference | Comment |
Tc | 684.8 | K | N/A | Ambrose, Broderick, et al., 1974 | Uncertainty assigned by TRC = 0.4 K; TRC |
Quantity | Value | Units | Method | Reference | Comment |
Pc | 32.27 | atm | N/A | Ambrose, Broderick, et al., 1974 | Uncertainty assigned by TRC = 0.39 atm; TRC |
Quantity | Value | Units | Method | Reference | Comment |
ΔvapH° | 12.9 | kcal/mol | N/A | Boublik, Fried, et al., 1984 | Based on data from 364. to 550. K. See also Basarová and Svoboda, 1991.; AC |
Reduced pressure boiling point
Tboil (K) | Pressure (atm) | Reference | Comment |
---|---|---|---|
352.7 | 0.016 | Aldrich Chemical Company Inc., 1990 | BS |
352.6 | 0.016 | PCR Inc., 1990 | BS |
Enthalpy of vaporization
ΔvapH (kcal/mol) | Temperature (K) | Method | Reference | Comment |
---|---|---|---|---|
11.8 | 379. | A | Stephenson and Malanowski, 1987 | Based on data from 364. to 496. K.; AC |
Enthalpy of fusion
ΔfusH (kcal/mol) | Temperature (K) | Reference | Comment |
---|---|---|---|
4.7395 | 335.01 | Andon and Martin, 1973 | Anomalous heat capacity between 285 and 305 K. Enthalpy of transition 18.1 J/mol (excess over extrapolated heat capacities).; DH |
4.7440 | 334.16 | Paukov and Glukhikh, 1969 | Smoothed table gives H = 4712 cal/mol, S = 14.12 cal/mol*K.; DH |
4.739 | 335. | Acree, 1991 | AC |
Entropy of fusion
ΔfusS (cal/mol*K) | Temperature (K) | Reference | Comment |
---|---|---|---|
14.15 | 335.01 | Andon and Martin, 1973 | Anomalous; DH |
14.20 | 334.16 | Paukov and Glukhikh, 1969 | Smoothed; DH |

Gas phase ion energetics data

Data compiled as indicated in comments:
LBLHLM - Sharon G. Lias, John E. Bartmess, Joel F. Liebman, John L. Holmes, Rhoda D. Levin, and W. Gary Mallard
LLK - Sharon G. Lias, Rhoda D. Levin, and Sherif A. Kafafi
Ionization energy determinations
IE (eV) | Method | Reference | Comment |
---|---|---|---|
9.3 | PE | Maier and Thommen, 1982 | LBLHLM |
9.48 ± 0.02 | PE | Mohraz, Maier, et al., 1980 | LLK |

References

Andon and Martin, 1973
Andon, R.J.L.; Martin, J.F.,
Thermodynamic properties of fluorine compounds. Part 12. Low-temperature heat capacity and entropy of 1,3,5-trichloro-2,4,6-trifluorobenzene,
J. Chem. Soc. Faraday Trans., 1973, I 69, 871-875. [all data]
Paukov and Glukhikh, 1969
Paukov, I.E.; Glukhikh, L.K.,
The true heat capacity in the range 13-350°K and the absolute entropy and enthalpy of 1,3,5-trichloro-2,4,6-trifluorobenzene,
Zhur. Fiz. Khim., 1969, 43, 226-228. [all data]
Andon and Martin, 1973, 2
Andon, J.L.; Martin, J.F.,
Thermodynamic properties of fluorine compounds: xii low-temperature heat capacity and entropy of 1,3,5-trichloro-2,4,6-trifluorobenzene,
J. Chem. Soc., Faraday Trans. 1, 1973, 69, 871. [all data]
Paukov and Glukhikh, 1969, 2
Paukov, I.E.; Glukhikh, L.K.,
The true heat capacity in the range 13-350 c and the absolute entropy and enthalpy of 1,3,5-trichloro-2,4,6-trifluorobenzene,
Zh. Fiz. Khim., 1969, 43, 226-8. [all data]
Ambrose, Broderick, et al., 1974
Ambrose, D.; Broderick, B.E.; Townsend, R.,
The Critical Temperatures and Pressures of Thirty Organic Compounds,
J. Appl. Chem. Biotechnol., 1974, 24, 359. [all data]
Boublik, Fried, et al., 1984
Boublik, T.; Fried, V.; Hala, E.,
The Vapour Pressures of Pure Substances: Selected Values of the Temperature Dependence of the Vapour Pressures of Some Pure Substances in the Normal and Low Pressure Region, 2nd ed., Elsevier, New York, 1984, 972. [all data]
Basarová and Svoboda, 1991
Basarová, Pavlína; Svoboda, Václav,
Calculation of heats of vaporization of halogenated hydrocarbons from saturated vapour pressure data,
Fluid Phase Equilibria, 1991, 68, 13-34, https://doi.org/10.1016/0378-3812(91)85008-I
. [all data]
Aldrich Chemical Company Inc., 1990
Aldrich Chemical Company Inc.,
Catalog Handbook of Fine Chemicals, Aldrich Chemical Company, Inc., Milwaukee WI, 1990, 1. [all data]
PCR Inc., 1990
PCR Inc.,
Research Chemicals Catalog 1990-1991, PCR Inc., Gainesville, FL, 1990, 1. [all data]
Stephenson and Malanowski, 1987
Stephenson, Richard M.; Malanowski, Stanislaw,
Handbook of the Thermodynamics of Organic Compounds, 1987, https://doi.org/10.1007/978-94-009-3173-2
. [all data]
Acree, 1991
Acree, William E.,
Thermodynamic properties of organic compounds: enthalpy of fusion and melting point temperature compilation,
Thermochimica Acta, 1991, 189, 1, 37-56, https://doi.org/10.1016/0040-6031(91)87098-H
. [all data]
Maier and Thommen, 1982
Maier, J.P.; Thommen, F.,
Photoelectron-photoion coincidence studies of halobenzene cations in their excited electronic states,
J. Chem. Phys., 1982, 77, 4427. [all data]
Mohraz, Maier, et al., 1980
Mohraz, M.; Maier, J.P.; Heilbronner, E.,
He(I α) and He(Iα) photoelectron spectra of fluorinated chloro- and bromobenzenes,
J. Electron Spectrosc. Relat. Phenom., 1980, 19, 429. [all data]