1-Phenyl-1,3-butadiene(Z)
- Formula: C10H10
- Molecular weight: 130.1864
- IUPAC Standard InChIKey: XZKRXPZXQLARHH-CLTKARDFSA-N
- CAS Registry Number: 31915-94-3
- Chemical structure:
View 3d structure (requires JavaScript / HTML 5) - Stereoisomers:

Gas phase ion energetics data

Data compiled as indicated in comments:
LBLHLM - Sharon G. Lias, John E. Bartmess, Joel F. Liebman, John L. Holmes, Rhoda D. Levin, and W. Gary Mallard
LLK - Sharon G. Lias, Rhoda D. Levin, and Sherif A. Kafafi
Ionization energy determinations
IE (eV) | Method | Reference | Comment |
---|---|---|---|
8.39 | EI | Dass and Gross, 1983 | LBLHLM |
8.1 | EI | Koppel, Schwarz, et al., 1974 | LLK |

References

Dass and Gross, 1983
Dass, C.; Gross, M.L.,
Electrocyclic ring opening of 1-phenylcyclobutene and 3-phenylcyclobutene radical cations,
J. Am. Chem. Soc., 1983, 105, 5724. [all data]
Koppel, Schwarz, et al., 1974
Koppel, C.; Schwarz, H.; Bohlmann, F.,
Elektronenstossinduzierte fragmentierung von acetylenverbindungen,
Org. Mass Spectrom., 1974, 9, 324. [all data]