Ethane, (chloromethoxy)-
- Formula: C3H7ClO
- Molecular weight: 94.540
- IUPAC Standard InChIKey: FCYRSDMGOLYDHL-UHFFFAOYSA-N
- CAS Registry Number: 3188-13-4
- Chemical structure:
View 3d structure (requires JavaScript / HTML 5) - Other names: Ether, chloromethyl ethyl; (Chloromethyl)ethyl ether; Chloromethoxyethane; Ethoxychloromethane; Ethoxymethyl chloride; Ethyl chloromethyl ether; ClCH2OC2H5; UN 2354

Phase change data

Data compiled by: Robert L. Brown and Stephen E. Stein
Quantity | Value | Units | Method | Reference | Comment |
---|---|---|---|---|---|
Tboil | 356.2 | K | N/A | Weast and Grasselli, 1989 |

Gas phase ion energetics data

Data compiled as indicated in comments:
LBLHLM - Sharon G. Lias, John E. Bartmess, Joel F. Liebman, John L. Holmes, Rhoda D. Levin, and W. Gary Mallard
Ionization energy determinations
IE (eV) | Method | Reference | Comment |
---|---|---|---|
10.30 | PE | Molder, Pikver, et al., 1983 | LBLHLM |

Normal alkane RI, non-polar column, temperature ramp

Column type | Active phase | I | Reference | Comment |
---|---|---|---|---|
Capillary | OV-101 | 634. | Zenkevich, 2005 | 25. m/0.20 mm/0.10 μm, N2/He, 6. K/min; Tstart: 50. C; Tend: 250. C |

References

Weast and Grasselli, 1989
CRC Handbook of Data on Organic Compounds, 2nd Editon, Weast,R.C and Grasselli, J.G., ed(s)., CRC Press, Inc., Boca Raton, FL, 1989, 1. [all data]
Molder, Pikver, et al., 1983
Molder, U.H.; Pikver, R.J.; Koppel, I.A.,
Photoelectron spectra of molecules. 2. Ethers,
Org. React. (N.Y. Engl. Transl.), 1983, 20, 208. [all data]
Zenkevich, 2005
Zenkevich, I.G.,
Experimentally measured retention indices., 2005. [all data]