Furan, 2-chloro-
- Formula: C4H3ClO
- Molecular weight: 102.519
- IUPAC Standard InChIKey: YSMYHWBQQONPRD-UHFFFAOYSA-N
- CAS Registry Number: 3187-94-8
- Chemical structure:
View 3d structure (requires JavaScript / HTML 5) - Other names: 2-Chlorofuran

Phase change data

Data compiled by: Thermodynamics Research Center, NIST Boulder Laboratories, Chris Muzny director
Quantity | Value | Units | Method | Reference | Comment |
---|---|---|---|---|---|
Tboil | 351.65 | K | N/A | Khodeir, Skulski, et al., 1986 | Uncertainty assigned by TRC = 2. K |
Tboil | 351.65 | K | N/A | Khodeir, Skulski, et al., 1986 | Uncertainty assigned by TRC = 2. K |

Gas phase ion energetics data

Data compiled by: Henry M. Rosenstock, Keith Draxl, Bruce W. Steiner, and John T. Herron
Ionization energy determinations
IE (eV) | Method | Reference |
---|---|---|
8.75 | PE | Baker and Turner, 1970 |

Normal alkane RI, non-polar column, temperature ramp

Column type | Active phase | I | Reference | Comment |
---|---|---|---|---|
Capillary | OV-101 | 628. | Zenkevich, 2005 | 25. m/0.20 mm/0.10 μm, N2/He, 6. K/min; Tstart: 50. C; Tend: 250. C |

References

Khodeir, Skulski, et al., 1986
Khodeir, N.M.; Skulski, L.; Wroczynski, P.,
Preparation of 2-Chlorofuran and 2-Chlorothiophene from the Respective Furan and Thiophene Mercurials and Disulfur Dichloride,
Bull. Pol. Acad. Sci., Chem., 1986, 34, 443. [all data]
Baker and Turner, 1970
Baker, A.D.; Turner, D.W.,
Orderings of π and σ ionization potentials in carbocyclic and heterocyclic aromatic compounds,
Phil. Trans. Roy. Soc. (London), 1970, A268, 131. [all data]
Zenkevich, 2005
Zenkevich, I.G.,
Experimentally measured retention indices., 2005. [all data]