Tricarbonyl(η5-2,4-cyclopentadien-1-yl)(trimethylstannyl)chromium
- Formula: C11H14CrO3Sn
- Molecular weight: 364.933
- CAS Registry Number: 31854-87-2

Gas phase ion energetics data

Data compiled by: Sharon G. Lias, Rhoda D. Levin, and Sherif A. Kafafi
Appearance energy determinations
Ion | AE (eV) | Other Products | Method | Reference | Comment |
---|---|---|---|---|---|
C3H9Sn+ | 9.1 ± 0.1 | ? | EI | Cardin, Keppie, et al., 1971 |

References

Cardin, Keppie, et al., 1971
Cardin, D.J.; Keppie, S.A.; Lappert, M.F.; Litzow, M.R.; Spalding, T.R.,
Binuclear organometallic compounds. Part III. Metal-metal bond dissociation energies, Raman, and infrared spectra for the series (π-C5H5)(CO)3M1M2Me3: (M1= Cr, Mo, or W; M2 = Ge or Sn),
J. Chem. Soc. A, 1971, 2262. [all data]