1-Propanol, 3-(dimethylamino)-
- Formula: C5H13NO
- Molecular weight: 103.1628
- IUPAC Standard InChIKey: PYSGFFTXMUWEOT-UHFFFAOYSA-N
- CAS Registry Number: 3179-63-3
- Chemical structure:
View 3d structure (requires JavaScript / HTML 5) - Other names: γ-(Dimethylamino)propanol; Dimethylaminopropanol; N,N-Dimethyl-γ-aminopropanol; N,N-Dimethyl-3-hydroxypropylamine; N,N-Dimethylaminopropanol; N,N-Dimethylpropanolamine; 1-(Dimethylamino)propan-3-ol; 1-Dimethylamino-3-propanol; 3-(Dimethlyamino)propanol; 3-(Dimethylamino)-1-propanol; 3-(Dimethylamino)propanol; 3-(N,N-Dimethylamino)-1-propanol; 3-(N,N-Dimethylamino)propanol; Dimethylpropanolamine; NSC 62086; 3-dimethylaminopropan-1-ol

Phase change data

Data compiled by: Robert L. Brown and Stephen E. Stein
Quantity | Value | Units | Method | Reference | Comment |
---|---|---|---|---|---|
Tboil | 436.7 | K | N/A | Weast and Grasselli, 1989 | |
Tboil | 436. to 437. | K | N/A | Buckingham and Donaghy, 1982 |
Reduced pressure boiling point
Tboil (K) | Pressure (bar) | Reference |
---|---|---|
346. to 349. | 0.044 | Buckingham and Donaghy, 1982 |

Gas phase ion energetics data

Data compiled by: Sharon G. Lias, Rhoda D. Levin, and Sherif A. Kafafi
Ionization energy determinations
IE (eV) | Method | Reference | Comment |
---|---|---|---|
8.74 ± 0.04 | PE | Leavell, Steichen, et al., 1973 | Vertical value |

References

Weast and Grasselli, 1989
CRC Handbook of Data on Organic Compounds, 2nd Editon, Weast,R.C and Grasselli, J.G., ed(s)., CRC Press, Inc., Boca Raton, FL, 1989, 1. [all data]
Buckingham and Donaghy, 1982
Buckingham, J.; Donaghy, S.M.,
Dictionary of Organic Compounds: Fifth Edition, Chapman and Hall, New York, 1982, 1. [all data]
Leavell, Steichen, et al., 1973
Leavell, S.; Steichen, J.; Franklin, J.L.,
Photoelectron spectra of intramolecularly hydrogen bonded compounds,
J. Chem. Phys., 1973, 59, 4343. [all data]