Cyclopropanemethanol, 1-phenyl-
- Formula: C10H12O
- Molecular weight: 148.2017
- IUPAC Standard InChIKey: APALRPYIDIBHQN-UHFFFAOYSA-N
- CAS Registry Number: 31729-66-5
- Chemical structure:
View 3d structure (requires JavaScript / HTML 5) - Other names: 1-Phenyl cyclopropane-1-methanol; α-Cyclopropylbenzyl alcohol; (1-Phenylcyclopropyl)methanol; 1-phenylcyclopropanemethanol

Gas phase ion energetics data

Data compiled as indicated in comments:
LLK - Sharon G. Lias, Rhoda D. Levin, and Sherif A. Kafafi
Ionization energy determinations
IE (eV) | Method | Reference | Comment |
---|---|---|---|
8.35 | EI | Dallinga, Nibbering, et al., 1981 | LLK |
Appearance energy determinations
Ion | AE (eV) | Other Products | Method | Reference | Comment |
---|---|---|---|---|---|
C8H8O+ | 9.38 | C2H4 | EI | Dallinga, Nibbering, et al., 1981 | LLK |

References

Dallinga, Nibbering, et al., 1981
Dallinga, J.W.; Nibbering, N.M.M.; Louter, G.J.,
Formation and structure of [C8H8O]+ ions, generated from gas phase ions of phenylcyclopropylcarbinol and 1-phenyl-1-(hydroxymethyl)cyclopropane,
Org. Mass Spectrom., 1981, 16, 4. [all data]