Thiophene, 2,5-dichloro-
- Formula: C4H2Cl2S
- Molecular weight: 153.030
- IUPAC Standard InChIKey: FGYBDASKYMSNCX-UHFFFAOYSA-N
- CAS Registry Number: 3172-52-9
- Chemical structure:
View 3d structure (requires JavaScript / HTML 5) - Other names: 2,5-Dichlorothiophene

Phase change data

Data compiled as indicated in comments:
BS - Robert L. Brown and Stephen E. Stein
AC - William E. Acree, Jr., James S. Chickos
Quantity | Value | Units | Method | Reference | Comment |
---|---|---|---|---|---|
Tboil | 435.2 | K | N/A | Weast and Grasselli, 1989 | BS |
Enthalpy of vaporization
ΔvapH (kJ/mol) | Temperature (K) | Method | Reference | Comment |
---|---|---|---|---|
49.9 | 338. | N/A | Dykyj, Svoboda, et al., 1999 | Based on data from 323. to 425. K.; AC |
36.2 | 338. | N/A | Dykyj, Svoboda, et al., 1999 | Based on data from 323. to 425. K.; AC |
33.7 | 348. | A,I | Stephenson and Malanowski, 1987 | Based on data from 333. to 374. K. See also Eon, Pommier, et al., 1971 and Dykyj, Svoboda, et al., 1999.; AC |
40.7 | 338. | N/A | Ditsent, Skorokhodov, et al., 1981 | Based on data from 323. to 425. K.; AC |
Antoine Equation Parameters
log10(P) = A − (B / (T + C))
P = vapor pressure (bar)
T = temperature (K)
View plot Requires a JavaScript / HTML 5 canvas capable browser.
Temperature (K) | A | B | C | Reference | Comment |
---|---|---|---|---|---|
333.4 to 373.5 | 3.9037 | 1715.367 | -4.69 | Eon, Pommier, et al., 1971 | Coefficents calculated by NIST from author's data. |
Enthalpy of fusion
ΔfusH (kJ/mol) | Temperature (K) | Reference | Comment |
---|---|---|---|
11.87 | 232.7 | Fujimori, Matsuda, et al., 2006 | AC |

Gas phase ion energetics data

Data compiled as indicated in comments:
LL - Sharon G. Lias and Joel F. Liebman
RDSH - Henry M. Rosenstock, Keith Draxl, Bruce W. Steiner, and John T. Herron
Ionization energy determinations
IE (eV) | Method | Reference | Comment |
---|---|---|---|
8.84 | PE | Veszpremi, Nyulaszi, et al., 1988 | LL |
8.60 ± 0.05 | PE | Baker, Betteridge, et al., 1970 | RDSH |

References

Weast and Grasselli, 1989
CRC Handbook of Data on Organic Compounds, 2nd Editon, Weast,R.C and Grasselli, J.G., ed(s)., CRC Press, Inc., Boca Raton, FL, 1989, 1. [all data]
Dykyj, Svoboda, et al., 1999
Dykyj, J.; Svoboda, J.; Wilhoit, R.C.; Frenkel, M.L.; Hall, K.R.,
Vapor Pressure of Chemicals: Part A. Vapor Pressure and Antoine Constants for Hydrocarbons and Sulfur, Selenium, Tellurium and Hydrogen Containing Organic Compounds, Springer, Berlin, 1999, 373. [all data]
Stephenson and Malanowski, 1987
Stephenson, Richard M.; Malanowski, Stanislaw,
Handbook of the Thermodynamics of Organic Compounds, 1987, https://doi.org/10.1007/978-94-009-3173-2
. [all data]
Eon, Pommier, et al., 1971
Eon, C.; Pommier, C.; Guiochon, G.,
Vapor pressures and second virial coefficients of some five-membered heterocyclic derivatives,
J. Chem. Eng. Data, 1971, 16, 4, 408-410, https://doi.org/10.1021/je60051a008
. [all data]
Ditsent, Skorokhodov, et al., 1981
Ditsent, V.E.; Skorokhodov, I.I.; Zolotareva, M.N.; Savuskina, V.I.; Tabenko, B.N.,
Zh. Prikl. Khim. (Leningrad), 1981, 54, 1617. [all data]
Fujimori, Matsuda, et al., 2006
Fujimori, H.; Matsuda, K.; Todoroki, A.; Asaji, T.; Oguni, M.,
Glass transition in the stable crystalline state of 2,5-dichlorothiophene,
Journal of Non-Crystalline Solids, 2006, 352, 42-49, 4790-4792, https://doi.org/10.1016/j.jnoncrysol.2006.02.181
. [all data]
Veszpremi, Nyulaszi, et al., 1988
Veszpremi, T.; Nyulaszi, L.; Zsombok, G.Y.,
Systematic hel UPS study of chlorothiophenes,
J. Electron Spectrosc. Relat. Phenom., 1988, 46, 269. [all data]
Baker, Betteridge, et al., 1970
Baker, A.D.; Betteridge, D.; Kemp, N.R.; Kirby, R.E.,
Application of photoelectron spectrometry to pesticide analysis. Photoelectron spectra of fivemembered heterocycles and related molecules,
Anal. Chem., 1970, 42, 1064. [all data]