Silane, [(methylthio)methylidyne]tris[trimethyl-
- Formula: C11H30SSi3
- Molecular weight: 278.677
- IUPAC Standard InChIKey: MVZAKYSSGMIRSP-UHFFFAOYSA-N
- CAS Registry Number: 31704-09-3
- Chemical structure:
View 3d structure (requires JavaScript / HTML 5) - Permanent link for this species. Use this link for bookmarking this species for future reference.

Gas phase ion energetics data

Data compiled by: Sharon G. Lias and Joel F. Liebman
Ionization energy determinations
IE (eV) | Method | Reference | Comment |
---|---|---|---|
7.3 | PE | Bock, Meuret, et al., 1990 | |
7.66 | PE | Bock, Meuret, et al., 1990 | Vertical value |

References

Bock, Meuret, et al., 1990
Bock, H.; Meuret, J.; Stein, U.,
Photoelectron spectra and molecular properties. CXXII. The low first ionization energies of the β-trimethylsilyl substituted sulfides (H3C)3SiH2CSCH2Si(CH3)3 and ((H3C)3Si)3CSCH3 and their rationalization,
J. Org. Chem., 1990, 398, 65. [all data]