1,3,5-Hexatriyne
- Formula: C6H2
- Molecular weight: 74.0801
- IUPAC Standard InChIKey: MZHROOGPARRVHS-UHFFFAOYSA-N
- CAS Registry Number: 3161-99-7
- Chemical structure:
View 3d structure (requires JavaScript / HTML 5) - Permanent link for this species. Use this link for bookmarking this species for future reference.

Gas phase thermochemistry data

Data compiled by: Glushko Thermocenter, Russian Academy of Sciences, Moscow
Constant pressure heat capacity of gas
Cp,gas (J/mol*K) | Temperature (K) | Reference | Comment |
---|---|---|---|
37.83 | 50. | Dorofeeva O.V., 1991 | There is an appreciable difference with other statistically calculated values [ Dessau L., 1988] because the authors used the estimated values of vibrational frequencies instead of experimental ones. |
51.07 | 100. | ||
66.20 | 150. | ||
81.37 | 200. | ||
99.14 | 273.15 | ||
103.9 ± 2.0 | 298.15 | ||
104.25 | 300. | ||
118.48 | 400. | ||
128.15 | 500. | ||
135.54 | 600. | ||
141.62 | 700. | ||
146.81 | 800. | ||
151.30 | 900. | ||
155.20 | 1000. | ||
158.60 | 1100. | ||
161.56 | 1200. | ||
164.15 | 1300. | ||
166.40 | 1400. | ||
168.38 | 1500. | ||
170.11 | 1600. | ||
171.63 | 1700. | ||
172.97 | 1800. | ||
174.15 | 1900. | ||
175.20 | 2000. |

Reaction thermochemistry data

Data compiled by: John E. Bartmess
Individual Reactions
C6H- + =
Quantity | Value | Units | Method | Reference | Comment |
---|---|---|---|---|---|
ΔrH° | 1501. ± 21. | kJ/mol | D-EA | Garand, Yacovitch, et al., 2010 | gas phase; Calns says linear H-terminated structure for anion |
ΔrH° | 1486. ± 13. | kJ/mol | G+TS | Natterer, Koch, et al., 1994 | gas phase; Acidity between (Me3Si)2NH and 4-Me-pyrazole |
Quantity | Value | Units | Method | Reference | Comment |
ΔrG° | 1467. ± 21. | kJ/mol | H-TS | Garand, Yacovitch, et al., 2010 | gas phase; Calns says linear H-terminated structure for anion |
ΔrG° | 1452. ± 13. | kJ/mol | IMRB | Natterer, Koch, et al., 1994 | gas phase; Acidity between (Me3Si)2NH and 4-Me-pyrazole |

Gas phase ion energetics data

Data compiled as indicated in comments:
B - John E. Bartmess
LLK - Sharon G. Lias, Rhoda D. Levin, and Sherif A. Kafafi
Ionization energy determinations
IE (eV) | Method | Reference | Comment |
---|---|---|---|
9.50 ± 0.02 | PE | Bieri, Burger, et al., 1977 | LLK |
9.50 | PE | Brogli, Heilbronner, et al., 1973 | LLK |
9.63 | PE | Bieri and Asbrink, 1980 | Vertical value; LLK |
De-protonation reactions
C6H- + =
Quantity | Value | Units | Method | Reference | Comment |
---|---|---|---|---|---|
ΔrH° | 1501. ± 21. | kJ/mol | D-EA | Garand, Yacovitch, et al., 2010 | gas phase; Calns says linear H-terminated structure for anion; B |
ΔrH° | 1486. ± 13. | kJ/mol | G+TS | Natterer, Koch, et al., 1994 | gas phase; Acidity between (Me3Si)2NH and 4-Me-pyrazole; B |
Quantity | Value | Units | Method | Reference | Comment |
ΔrG° | 1467. ± 21. | kJ/mol | H-TS | Garand, Yacovitch, et al., 2010 | gas phase; Calns says linear H-terminated structure for anion; B |
ΔrG° | 1452. ± 13. | kJ/mol | IMRB | Natterer, Koch, et al., 1994 | gas phase; Acidity between (Me3Si)2NH and 4-Me-pyrazole; B |

References

Dorofeeva O.V., 1991
Dorofeeva O.V.,
Thermodynamic properties of linear carbon chain molecules with conjugated triple bonds. Part I. Polyacetylenes, H(CC)nH (n=2-6), cyanopolyacetylenes, H(CC)nCN (n=1-5), and dicyanopolyacetylenes, NC(CC)nCN (n=1-4),
Thermochim. Acta, 1991, 178, 273-286. [all data]
Dessau L., 1988
Dessau L.,
Vibrations and thermodynamic functions of long-chain acetylenes,
Z. Phys. Chem. (Leipzig), 1988, 269, 187-190. [all data]
Garand, Yacovitch, et al., 2010
Garand, E.; Yacovitch, T.I.; Zhou, J.; Sheehan, S.M.; Neumark, D.M.,
Slow photoelectron velocity-map imaging of the CnH- (n=5-9) anions,
Chem. Sci., 2010, 1, 2, 192-201, https://doi.org/10.1039/c0sc00164c
. [all data]
Natterer, Koch, et al., 1994
Natterer, J.; Koch, W.; Schroder, D.; Goldberg, N.; Schwarz, H.,
Combined experimental and theoretical study of the C-H bond strength and the gas phase acidity of triacetylene, C6H2, and the electron affinity of the C6H. radical,
Chem. Phys. Lett., 1994, 229, 4-5, 429, https://doi.org/10.1016/0009-2614(94)01075-7
. [all data]
Bieri, Burger, et al., 1977
Bieri, G.; Burger, F.; Heilbronner, E.; Maier, J.P.,
Valence ionization enrgies of hydrocarbons,
Helv. Chim. Acta, 1977, 60, 2213. [all data]
Brogli, Heilbronner, et al., 1973
Brogli, F.; Heilbronner, E.; Hornung, V.; Kloster-Jensen, E.,
230. Die photoelektronen-spektren methyl-substituierter Acetylene,
Helv. Chim. Acta, 1973, 56, 2171. [all data]
Bieri and Asbrink, 1980
Bieri, G.; Asbrink, L.,
30.4-nm He(II) photoelectron spectra of organic molecules,
J. Electron Spectrosc. Relat. Phenom., 1980, 20, 149. [all data]