Germane,trimethyl-1-naphthalenyl-
- Formula: C13H16Ge
- Molecular weight: 244.91
- IUPAC Standard InChIKey: VKYZGTYQKPGZKM-UHFFFAOYSA-N
- CAS Registry Number: 31608-60-3
- Chemical structure:
View 3d structure (requires JavaScript / HTML 5) - Permanent link for this species. Use this link for bookmarking this species for future reference.

Gas phase ion energetics data

Data compiled by: Sharon G. Lias, Rhoda D. Levin, and Sherif A. Kafafi
Ionization energy determinations
IE (eV) | Method | Reference |
---|---|---|
8.00 | CTS | Pitt, 1973 |

References

Pitt, 1973
Pitt, C.G.,
Hyperconjugation and its role in group IV chemistry,
J. Organomet. Chem., 1973, 61, 49. [all data]