Pyrimidine,2-fluoro-
- Formula: C4H3FN2
- Molecular weight: 98.0784
- IUPAC Standard InChIKey: WAVYAFBQOXCGSZ-UHFFFAOYSA-N
- CAS Registry Number: 31575-35-6
- Chemical structure:
View 3d structure (requires JavaScript / HTML 5) - Permanent link for this species. Use this link for bookmarking this species for future reference.

Gas phase ion energetics data

Data compiled by: Sharon G. Lias, Rhoda D. Levin, and Sherif A. Kafafi
Ionization energy determinations
IE (eV) | Method | Reference |
---|---|---|
10.5 | PE | Van den Ham, Van der Meer, et al., 1974 |

References

Van den Ham, Van der Meer, et al., 1974
Van den Ham, D.M.W.; Van der Meer, D.; Feil, D.,
Photoelectron spectra of fluorine-substituted diazabenzenes,
J. Electron Spectrosc. Relat. Phenom., 1974, 3, 479. [all data]
(editor), 1975
(editor), Koptyug V.A.,
Atlas of Spectra of Aromatic and Heterocyclic Compounds, 1975, 8, 18. [all data]