Propene, 3-nitro-
- Formula: C3H5NO2
- Molecular weight: 87.0773
- IUPAC Standard InChIKey: VLISOFDTMSFZPP-UHFFFAOYSA-N
- CAS Registry Number: 3156-70-5
- Chemical structure:
View 3d structure (requires JavaScript / HTML 5) - Species with the same structure:

Phase change data

Data compiled as indicated in comments:
BS - Robert L. Brown and Stephen E. Stein
AC - William E. Acree, Jr., James S. Chickos
Reduced pressure boiling point
Tboil (K) | Pressure (bar) | Reference | Comment |
---|---|---|---|
332.7 | 0.045 | Weast and Grasselli, 1989 | BS |
Enthalpy of vaporization
ΔvapH (kJ/mol) | Temperature (K) | Method | Reference | Comment |
---|---|---|---|---|
44.1 | 288. | A | Stephenson and Malanowski, 1987 | Based on data from 273. to 333. K. See also Dykyj, 1970.; AC |
37.1 | 337. | N/A | Bosco and Turner, 1984 | Based on data from 301. to 373. K.; AC |

Gas phase ion energetics data

Data compiled by: Sharon G. Lias and Joel F. Liebman
Ionization energy determinations
IE (eV) | Method | Reference |
---|---|---|
10.4 | PE | Chin, Mok, et al., 1991 |
10.73 | PE | Chin, Mok, et al., 1991 |

References

Weast and Grasselli, 1989
CRC Handbook of Data on Organic Compounds, 2nd Editon, Weast,R.C and Grasselli, J.G., ed(s)., CRC Press, Inc., Boca Raton, FL, 1989, 1. [all data]
Stephenson and Malanowski, 1987
Stephenson, Richard M.; Malanowski, Stanislaw,
Handbook of the Thermodynamics of Organic Compounds, 1987, https://doi.org/10.1007/978-94-009-3173-2
. [all data]
Dykyj, 1970
Dykyj, J.,
Petrochemica, 1970, 10, 2, 51. [all data]
Bosco and Turner, 1984
Bosco, Salvatore R.; Turner, Almon G.,
Vapor pressure of 1-nitropropene,
J. Chem. Eng. Data, 1984, 29, 3, 242-243, https://doi.org/10.1021/je00037a002
. [all data]
Chin, Mok, et al., 1991
Chin, W.S.; Mok, C.Y.; Huang, H.H.,
He I and He II photoelectron spectra of isomeric nitropropenes,
J. Chem. Soc. Faraday Trans., 1991, 87, 1685. [all data]