3,3-Dimethyl-2,4-pentane dione
- Formula: C7H12O2
- Molecular weight: 128.1690
- IUPAC Standard InChIKey: SWGDHTSWHSSMLE-UHFFFAOYSA-N
- CAS Registry Number: 3142-58-3
- Chemical structure:
View 3d structure (requires JavaScript / HTML 5) - Other names: 2,4-Pentanedione, 3,3-dimethyl-; Dimethylacetylacetone; 3,3-Dimethylacetylacetone; 3,3-dimethylpentane-2,4-dione

Gas phase ion energetics data

Data compiled by: Sharon G. Lias, Rhoda D. Levin, and Sherif A. Kafafi
Ionization energy determinations
IE (eV) | Method | Reference | Comment |
---|---|---|---|
9.30 | PE | Schweig, Vermeer, et al., 1974 | Vertical value |

References

Schweig, Vermeer, et al., 1974
Schweig, A.; Vermeer, H.; Weidner, U.,
A photoelectron spectroscopic study of keto-enol tautomerism in acetylacetones - a new application of photoelectron spectroscopy,
Chem. Phys. Lett., 1974, 26, 229. [all data]