Butanal, O-methyloxime
- Formula: C5H11NO
- Molecular weight: 101.1469
- IUPAC Standard InChIKey: BMDFNHAUSSAITP-UHFFFAOYSA-N
- CAS Registry Number: 31376-98-4
- Chemical structure:
View 3d structure (requires JavaScript / HTML 5) - Permanent link for this species. Use this link for bookmarking this species for future reference.

Gas phase ion energetics data

Data compiled by: Sharon G. Lias, Rhoda D. Levin, and Sherif A. Kafafi
Ionization energy determinations
IE (eV) | Method | Reference |
---|---|---|
9.33 ± 0.05 | EI | Thorstad, Undheim, et al., 1975 |

Normal alkane RI, non-polar column, temperature ramp

Column type | Active phase | I | Reference | Comment |
---|---|---|---|---|
Capillary | OV-101 | 680. | Zenkevich, 2005 | 25. m/0.20 mm/0.10 μm, N2/He, 6. K/min; Tstart: 50. C; Tend: 250. C |

References

Thorstad, Undheim, et al., 1975
Thorstad, O.; Undheim, K.; El-Gendy, M.A.F.,
Ionisation potentials in structure analysis of isomeric nitrones, oxaziranes, O-ether oximes acid amides,
Org. Mass Spectrom., 1975, 10, 1155. [all data]
Zenkevich, 2005
Zenkevich, I.G.,
Experimentally measured retention indices., 2005. [all data]