Perfluoronaphthalene
- Formula: C10F8
- Molecular weight: 272.0942
- IUPAC Standard InChIKey: JDCMOHAFGDQQJX-UHFFFAOYSA-N
- CAS Registry Number: 313-72-4
- Chemical structure:
View 3d structure (requires JavaScript / HTML 5) - Other names: Octafluoronaphthalene; Naphthalene, octafluoro-

Phase change data

Data compiled by: William E. Acree, Jr., James S. Chickos
Enthalpy of sublimation
ΔsubH (kJ/mol) | Temperature (K) | Method | Reference | Comment |
---|---|---|---|---|
79.4 ± 2.5 | 308. | A | Stephenson and Malanowski, 1987 | Based on data from 293. to 323. K. See also Radchenko and Kataigorodskii, 1974. |
Enthalpy of fusion
ΔfusH (kJ/mol) | Temperature (K) | Reference |
---|---|---|
17.55 | 358.8 | Michaud, Negrier, et al., 1999 |

Gas phase ion energetics data

Data evaluated as indicated in comments:
L - Sharon G. Lias
Data compiled as indicated in comments:
LBLHLM - Sharon G. Lias, John E. Bartmess, Joel F. Liebman, John L. Holmes, Rhoda D. Levin, and W. Gary Mallard
LLK - Sharon G. Lias, Rhoda D. Levin, and Sherif A. Kafafi
Quantity | Value | Units | Method | Reference | Comment |
---|---|---|---|---|---|
IE (evaluated) | 8.87 ± 0.02 | eV | N/A | N/A | L |
Ionization energy determinations
IE (eV) | Method | Reference | Comment |
---|---|---|---|
8.85 | PE | Hohlneicher, Distler, et al., 1984 | LBLHLM |
8.90 ± 0.05 | PE | Bastide, Hall, et al., 1979 | LLK |
8.85 | PE | Brundle, Robin, et al., 1972 | LLK |

Normal alkane RI, non-polar column, temperature ramp

Column type | Active phase | I | Reference | Comment |
---|---|---|---|---|
Capillary | PB-1 | 1090. | Andersson and Weis, 1994 | 50. m/0.32 mm/0.2 μm, H2, 80. C @ 2. min, 4. K/min, 270. C @ 5. min |
Capillary | DB-5 | 1103. | Andersson and Weis, 1994 | 30. m/0.32 mm/0.25 μm, H2, 80. C @ 2. min, 4. K/min, 270. C @ 5. min |

Lee's RI, non-polar column, temperature ramp

Column type | Active phase | I | Reference | Comment |
---|---|---|---|---|
Capillary | PB-1 | 186.73 | Andersson and Weis, 1994 | 50. m/0.32 mm/0.2 μm, H2, 80. C @ 2. min, 4. K/min, 270. C @ 5. min |
Capillary | DB-5 | 189.2 | Andersson and Weis, 1994 | 30. m/0.32 mm/0.25 μm, H2, 80. C @ 2. min, 4. K/min, 270. C @ 5. min |
Lee's RI, polar column, temperature ramp
Column type | Active phase | I | Reference | Comment |
---|---|---|---|---|
Capillary | DB-Wax | 162.99 | Andersson and Weis, 1994 | 30. m/0.2 mm/0.15 μm, H2, 80. C @ 2. min, 4. K/min, 270. C @ 5. min |

References

Stephenson and Malanowski, 1987
Stephenson, Richard M.; Malanowski, Stanislaw,
Handbook of the Thermodynamics of Organic Compounds, 1987, https://doi.org/10.1007/978-94-009-3173-2
. [all data]
Radchenko and Kataigorodskii, 1974
Radchenko, L.G.; Kataigorodskii, A.I.,
Zh. Fiz. Khim., 1974, 48, 2702. [all data]
Michaud, Negrier, et al., 1999
Michaud, F.; Negrier, Ph.; Mikailitchenko, D.; Marbeuf, A.; Haget, Y.; Cuevas-diarte, M.; Oonk, H.A.J.,
Measurement and Analysis of the Naphthalene --- Octafluoronaphthalene Phase Diagram: Complex Formation in Solid and Liquid,
Molecular Crystals and Liquid Crystals Science and Technology. Section A. Molecular Crystals and Liquid Crystals, 1999, 326, 1, 409-424, https://doi.org/10.1080/10587259908025429
. [all data]
Hohlneicher, Distler, et al., 1984
Hohlneicher, G.; Distler, D.; Muller, M.; Freund, H.-J.,
Identification of shake-up satellites in valence photoelectron spectra of organic compounds by comparison with electronic absorption spectra of radical cations. Case study: Octafluoronaphthalene,
Chem. Phys. Lett., 1984, 111, 151. [all data]
Bastide, Hall, et al., 1979
Bastide, J.; Hall, D.; Heilbronner, E.; Maier, J.P.,
He(Iα) photoelectron spectra of some higher aromatic perfluoro compounds,
J. Electron Spectrosc. Relat. Phenom., 1979, 16, 205. [all data]
Brundle, Robin, et al., 1972
Brundle, C.R.; Robin, M.B.; Kuebler, N.A.,
Perfluoro effect in photoelectron spectroscopy. II. Aromatic molecules,
J. Am. Chem. Soc., 1972, 94, 1466. [all data]
Jakobson, Shteingarts, et al., 1964
Jakobson, G.G.; Shteingarts, V.D.; Vorozhtsov, N.N., Jr.,
Synthesis of octofluoronaphthalene and dekafluorodiphenyl,
Izv. Akad. Nauk SSSR, Ser. Khim., 1964, 1551-1552. [all data]
Andersson and Weis, 1994
Andersson, J.T.; Weis, U.,
Gas Chromatographic Determination of Polycyclic Aromatic Compounds with Fluorinated Analogues as Internal Standards,
J. Chromatogr. A, 1994, 659, 1, 151-161, https://doi.org/10.1016/0021-9673(94)85017-8
. [all data]