4,7,13,16,21-Pentaoxa-1,10-diazabicyclo[8.8.5]tricosane
- Formula: C16H32N2O5
- Molecular weight: 332.4357
- IUPAC Standard InChIKey: HDLXPNDSLDLJHF-UHFFFAOYSA-N
- CAS Registry Number: 31364-42-8
- Chemical structure:
View 3d structure (requires JavaScript / HTML 5) - Other names: 4,7,13,16,21-Pentaoxa-1,10-diazabicyclo[8.8.5.]tricosane; Kryptofix 221; 4,7,16,21-Pentaoxa-1,10-diazabicyclo[8.8.5.]tricosane

Gas phase ion energetics data

Data compiled as indicated in comments:
LBLHLM - Sharon G. Lias, John E. Bartmess, Joel F. Liebman, John L. Holmes, Rhoda D. Levin, and W. Gary Mallard
Ionization energy determinations
IE (eV) | Method | Reference | Comment |
---|---|---|---|
7.4 | PE | Baker, Armen, et al., 1983 | LBLHLM |
7.7 | PE | Baker, Armen, et al., 1983 | Vertical value; LBLHLM |

References

Baker, Armen, et al., 1983
Baker, A.D.; Armen, G.H.; Funaro, S.,
Oral levels of crown ethers and related macrocycles studies by ultraviolet photoelectron spectroscopy: Relationship to complexation studies,
J. Chem. Soc. Dalton Trans., 1983, 2519. [all data]