CH2NHCH3
- Formula: C2H6N
- Molecular weight: 44.0757
- IUPAC Standard InChIKey: AQIAIZBHFAKICS-UHFFFAOYSA-N
- CAS Registry Number: 31277-24-4
- Chemical structure:
View 3d structure (requires JavaScript / HTML 5) - Permanent link for this species. Use this link for bookmarking this species for future reference.

Gas phase ion energetics data

Data compiled as indicated in comments:
LBLHLM - Sharon G. Lias, John E. Bartmess, Joel F. Liebman, John L. Holmes, Rhoda D. Levin, and W. Gary Mallard
LLK - Sharon G. Lias, Rhoda D. Levin, and Sherif A. Kafafi
Quantity | Value | Units | Method | Reference | Comment |
---|---|---|---|---|---|
ΔfH°(+) ion | 695. | kJ/mol | N/A | N/A |
Ionization energy determinations
IE (eV) | Method | Reference | Comment |
---|---|---|---|
5.9 | DER | Burkey, Castelhano, et al., 1983 | LBLHLM |
5.9 | DER | Griller and Lossing, 1981 | LLK |

References

Burkey, Castelhano, et al., 1983
Burkey, T.J.; Castelhano, A.L.; Griller, D.; Lossing, F.P.,
Heats of formation and ionization potentials of some α-aminoalkyl radicals,
J. Am. Chem. Soc., 1983, 105, 4701. [all data]
Griller and Lossing, 1981
Griller, D.; Lossing, F.P.,
On the thermochemistry of α-aminoalkyl radicals,
J. Am. Chem. Soc., 1981, 103, 1586. [all data]