4,7,13-Trioxa-1,10-diazacyclopentadecane
- Formula: C10H22N2O3
- Molecular weight: 218.2933
- IUPAC Standard InChIKey: STHIZMRUXPMSCW-UHFFFAOYSA-N
- CAS Registry Number: 31249-95-3
- Chemical structure:
View 3d structure (requires JavaScript / HTML 5) - Other names: 1,4,10-Trioxa-7,13-diazacyclopentadecane; Kryptofix 21; 1,7,10-Trioxa-4,13-diazacyclopentadecane

Gas phase ion energetics data

Data compiled as indicated in comments:
LBLHLM - Sharon G. Lias, John E. Bartmess, Joel F. Liebman, John L. Holmes, Rhoda D. Levin, and W. Gary Mallard
Ionization energy determinations
IE (eV) | Method | Reference | Comment |
---|---|---|---|
8.2 | PE | Baker, Armen, et al., 1983 | LBLHLM |
8.4 | PE | Baker, Armen, et al., 1983 | Vertical value; LBLHLM |

References

Baker, Armen, et al., 1983
Baker, A.D.; Armen, G.H.; Funaro, S.,
Oral levels of crown ethers and related macrocycles studies by ultraviolet photoelectron spectroscopy: Relationship to complexation studies,
J. Chem. Soc. Dalton Trans., 1983, 2519. [all data]