Perfluorotributylamine
- Formula: C12F27N
- Molecular weight: 671.0920
- IUPAC Standard InChIKey: RVZRBWKZFJCCIB-UHFFFAOYSA-N
- CAS Registry Number: 311-89-7
- Chemical structure:
View 3d structure (requires JavaScript / HTML 5) - Other names: PFTBA; 1-Butanamine, 1,1,2,2,3,3,4,4,4-nonafluoro-N,N-bis(nonafluorobutyl)-; FC 43; FC 47; Fluorinert FC 43; Fluorocarbon FC 43; Heptacosafluorotributylamine; Mediflor FC 43; Medifluor FC 47; Tributylamine, heptacosafluoro-; (n-C4F9)3N; tri(Perfluorobutyl)amine; Perfluorotri-n-butylamine; Heptacosafluorotri-n-butylamine; Butylamine, 1,1,2,2,3,3,4,4,4-nonafluoro-N,N-bis(nonafluorobutyl)-; Fluosol 43; Tri(nonafluorobutyl)amine; Tris(nonafluorobutyl)amine; Tris(perfluorobutyl)amine; 1-Butanamine, 1,1,2,2,3,3,4,4,4-nonafluoro-N,N-bis(1,1,2,2,3,3,4,4,4-nonafluorobutyl)-; NSC 3501

Gas phase thermochemistry data

Data compiled by: Hussein Y. Afeefy, Joel F. Liebman, and Stephen E. Stein
Quantity | Value | Units | Method | Reference | Comment |
---|---|---|---|---|---|
ΔfH°gas | -5583.5 | kJ/mol | Ccr | Erastov and Kolesov, 1979 | The hf_condensed corrected by Kolesov and Kozina, 1986 |

Condensed phase thermochemistry data

Data compiled by: Hussein Y. Afeefy, Joel F. Liebman, and Stephen E. Stein
Quantity | Value | Units | Method | Reference | Comment |
---|---|---|---|---|---|
ΔfH°liquid | -5643.8 | kJ/mol | Ccr | Erastov and Kolesov, 1979 | The hf_condensed corrected by Kolesov and Kozina, 1986 |
Quantity | Value | Units | Method | Reference | Comment |
ΔcH°liquid | -3852. ± 9.2 | kJ/mol | Ccr | Erastov and Kolesov, 1979 | The hf_condensed corrected by Kolesov and Kozina, 1986 |

Phase change data

Data compiled as indicated in comments:
BS - Robert L. Brown and Stephen E. Stein
TRC - Thermodynamics Research Center, NIST Boulder Laboratories, Chris Muzny director
AC - William E. Acree, Jr., James S. Chickos
ALS - Hussein Y. Afeefy, Joel F. Liebman, and Stephen E. Stein
Quantity | Value | Units | Method | Reference | Comment |
---|---|---|---|---|---|
Tboil | 451. | K | N/A | PCR Inc., 1990 | BS |
Tboil | 452.2 | K | N/A | Weast and Grasselli, 1989 | BS |
Tboil | 451.95 | K | N/A | Kyle and Tetlow, 1960 | Uncertainty assigned by TRC = 1. K; TRC |
Quantity | Value | Units | Method | Reference | Comment |
ΔvapH° | 60.3 ± 0.1 | kJ/mol | C | Varouchtchenko and Droujinina, 1995 | AC |
ΔvapH° | 60.4 ± 1.2 | kJ/mol | V | Erastov and Kolesov, 1979 | The hf_condensed corrected by Kolesov and Kozina, 1986; ALS |
ΔvapH° | 60.4 ± 1.2 | kJ/mol | N/A | Varushchenko, Ammar, et al., 1977 | See also Varushchenko, Ammar, et al., 1977, 2.; AC |
Enthalpy of vaporization
ΔvapH (kJ/mol) | Temperature (K) | Method | Reference | Comment |
---|---|---|---|---|
57.4 | 313. | A | Stephenson and Malanowski, 1987 | Based on data from 298. to 450. K.; AC |
51.1 | 386. | A | Stephenson and Malanowski, 1987 | Based on data from 371. to 544. K.; AC |

Gas phase ion energetics data

Data compiled as indicated in comments:
LBLHLM - Sharon G. Lias, John E. Bartmess, Joel F. Liebman, John L. Holmes, Rhoda D. Levin, and W. Gary Mallard
Ionization energy determinations
IE (eV) | Method | Reference | Comment |
---|---|---|---|
11.30 | PE | Molder, Pikver, et al., 1983 | LBLHLM |
11.3 | PE | Elbel, Dieck, et al., 1982 | LBLHLM |
11.7 | PE | Elbel, Dieck, et al., 1982 | Vertical value; LBLHLM |

References

Erastov and Kolesov, 1979
Erastov, P.A.; Kolesov, V.P.,
Thermodynamic properties of nitrogen-containing organofluorine compounds. Enthalpies of formation of perfluorotriethylamine and perfluorotributylamine,
J. Gen. Chem. USSR (Engl. Transl.), 1979, 49, 1186-1189. [all data]
Kolesov and Kozina, 1986
Kolesov, V.P.; Kozina, M.P.,
Thermochemistry of organic and organohalogen compounds,
Russ. Chem. Rev., 1986, 55, 912. [all data]
PCR Inc., 1990
PCR Inc.,
Research Chemicals Catalog 1990-1991, PCR Inc., Gainesville, FL, 1990, 1. [all data]
Weast and Grasselli, 1989
CRC Handbook of Data on Organic Compounds, 2nd Editon, Weast,R.C and Grasselli, J.G., ed(s)., CRC Press, Inc., Boca Raton, FL, 1989, 1. [all data]
Kyle and Tetlow, 1960
Kyle, B.G.; Tetlow, N.J.,
Perfluorotributylamine as an Extractive Distillation Solvent for a Hydrocarbon Mixture,
J. Chem. Eng. Data, 1960, 5, 275. [all data]
Varouchtchenko and Droujinina, 1995
Varouchtchenko, R.M.; Droujinina, A.I.,
Thermodynamics of vaporization of some perfluorotrialkylamines,
J. Chem. Thermodyn., 1995, 27, 355-368. [all data]
Varushchenko, Ammar, et al., 1977
Varushchenko, R.M.; Ammar, M.M.; Bulgakova, L.L.,
Russ. J. Phys. Chem., 1977, 51, 167. [all data]
Varushchenko, Ammar, et al., 1977, 2
Varushchenko, R.M.; Ammar, M.M.; Bulgakova, L.L.,
Zh. Fiz. Khim., 1977, 51, 278. [all data]
Stephenson and Malanowski, 1987
Stephenson, Richard M.; Malanowski, Stanislaw,
Handbook of the Thermodynamics of Organic Compounds, 1987, https://doi.org/10.1007/978-94-009-3173-2
. [all data]
Molder, Pikver, et al., 1983
Molder, U.H.; Pikver, R.J.; Koppel, I.A.,
Photoelectron spectra of molecules. 4. Amines,
Org. React. Tartu, 1983, 20, 355. [all data]
Elbel, Dieck, et al., 1982
Elbel, S.; Dieck, H.T.; Demuth, R.,
Photoelectron sSpectra of group V compounds. IX. The relative perfluoroalkyl substituent effect,
J. Fluorine Chem., 1982, 19, 349. [all data]