Bicyclo[1.1.1]pentane
- Formula: C5H8
- Molecular weight: 68.1170
- IUPAC Standard InChIKey: MKCBRYIXFFGIKN-UHFFFAOYSA-N
- CAS Registry Number: 311-75-1
- Chemical structure:
View 3d structure (requires JavaScript / HTML 5) - Permanent link for this species. Use this link for bookmarking this species for future reference.

Gas phase thermochemistry data

Data compiled by: Glushko Thermocenter, Russian Academy of Sciences, Moscow
Constant pressure heat capacity of gas
Cp,gas (J/mol*K) | Temperature (K) | Reference | Comment |
---|---|---|---|
33.97 | 100. | Wiberg K.B., 1975 | |
49.41 | 200. | ||
73.14 | 273.15 | ||
82.34 | 298.15 | ||
83.05 | 300. | ||
119.50 | 400. | ||
150.41 | 500. |

Phase change data

Data compiled by: Robert L. Brown and Stephen E. Stein
Quantity | Value | Units | Method | Reference | Comment |
---|---|---|---|---|---|
Tboil | 309. | K | N/A | Buckingham and Donaghy, 1982 |

Gas phase ion energetics data

Data compiled as indicated in comments:
B - John E. Bartmess
RDSH - Henry M. Rosenstock, Keith Draxl, Bruce W. Steiner, and John T. Herron
Ionization energy determinations
IE (eV) | Method | Reference | Comment |
---|---|---|---|
9.65 | EI | Wiberg and Connor, 1966 | RDSH |
Appearance energy determinations
Ion | AE (eV) | Other Products | Method | Reference | Comment |
---|---|---|---|---|---|
C5H7+ | 10.60 | H | EI | Wiberg and Connor, 1966 | RDSH |
De-protonation reactions
C5H7- + =
Quantity | Value | Units | Method | Reference | Comment |
---|---|---|---|---|---|
ΔrH° | 1720. ± 15. | kJ/mol | CIDT | Graul and Squires, 1990 | gas phase; Reed, Kass, et al., 2002 claim this is the 1,4-pentadien-2-ide anion; B |
Quantity | Value | Units | Method | Reference | Comment |
ΔrG° | 1684. ± 15. | kJ/mol | H-TS | Graul and Squires, 1990 | gas phase; Reed, Kass, et al., 2002 claim this is the 1,4-pentadien-2-ide anion; B |

Reaction thermochemistry data

Data compiled by: John E. Bartmess
Individual Reactions
C5H7- + =
Quantity | Value | Units | Method | Reference | Comment |
---|---|---|---|---|---|
ΔrH° | 1720. ± 15. | kJ/mol | CIDT | Graul and Squires, 1990 | gas phase; Reed, Kass, et al., 2002 claim this is the 1,4-pentadien-2-ide anion |
Quantity | Value | Units | Method | Reference | Comment |
ΔrG° | 1684. ± 15. | kJ/mol | H-TS | Graul and Squires, 1990 | gas phase; Reed, Kass, et al., 2002 claim this is the 1,4-pentadien-2-ide anion |

References

Wiberg K.B., 1975
Wiberg K.B.,
Vibrational spectrum of bicyclo[1.1.1]pentane,
Spectrochim. Acta, 1975, A31, 57-73. [all data]
Buckingham and Donaghy, 1982
Buckingham, J.; Donaghy, S.M.,
Dictionary of Organic Compounds: Fifth Edition, Chapman and Hall, New York, 1982, 1. [all data]
Wiberg and Connor, 1966
Wiberg, K.B.; Connor, D.S.,
Bicyclo[1.1.1]pentane,
J. Am. Chem. Soc., 1966, 88, 4437. [all data]
Graul and Squires, 1990
Graul, S.T.; Squires, R.R.,
Gas-Phase Acidities Derived from Threshold Energies for Activated Reactions,
J. Am. Chem. Soc., 1990, 112, 7, 2517, https://doi.org/10.1021/ja00163a007
. [all data]
Reed, Kass, et al., 2002
Reed, D.R.; Kass, S.R.; Mondanaro, K.R.; Dailey, W.P.,
Formation of a 1-bicyclo[1.1.1]pentyl anion and an experimental determination of the acidity and C-H bond dissociation energy of 3-tert-butylbicyclo[1.1.1]pentane,
J. Am. Chem. Soc., 2002, 124, 11, 2790-2795, https://doi.org/10.1021/ja0121890
. [all data]