Benzene, 1,1'-(2-cyclohexen-1-ylidene)bis-
- Formula: C18H18
- Molecular weight: 234.3355
- IUPAC Standard InChIKey: UYRONKCXUIRUGJ-UHFFFAOYSA-N
- CAS Registry Number: 31158-25-5
- Chemical structure:
View 3d structure (requires JavaScript / HTML 5) - Other names: Cyclohexene, 3,3-diphenyl-

Gas phase ion energetics data

Data compiled by: Sharon G. Lias, Rhoda D. Levin, and Sherif A. Kafafi
Appearance energy determinations
Ion | AE (eV) | Other Products | Method | Reference | Comment |
---|---|---|---|---|---|
C9H7+ | 13.6 ± 0.4 | ? | EI | Fortin and Rousseau, 1973 | |
C13H9+ | 13.0 ± 0.4 | ? | EI | Fortin and Rousseau, 1973 | |
C14H10+ | 10.4 ± 0.4 | ? | EI | Fortin and Rousseau, 1973 | |
C14H12+ | 9.8 ± 0.4 | ? | EI | Fortin and Rousseau, 1973 |

References

Fortin and Rousseau, 1973
Fortin, C.J.; Rousseau, Y.,
Spectrometrie de masse des cyclohexanones gem-diphenylees. II. Chaleurs de formation et structures possibles des principaux ions fragmentaires,
Can. J. Chem., 1973, 51, 3457. [all data]