Bromocyanoacetylene
- Formula: C3BrN
- Molecular weight: 129.943
- IUPAC Standard InChIKey: NGGPAYDRGCXCBY-UHFFFAOYSA-N
- CAS Registry Number: 3114-46-3
- Chemical structure:
View 3d structure (requires JavaScript / HTML 5) - Permanent link for this species. Use this link for bookmarking this species for future reference.

Gas phase ion energetics data

Data compiled as indicated in comments:
LBLHLM - Sharon G. Lias, John E. Bartmess, Joel F. Liebman, John L. Holmes, Rhoda D. Levin, and W. Gary Mallard
LLK - Sharon G. Lias, Rhoda D. Levin, and Sherif A. Kafafi
Ionization energy determinations
IE (eV) | Method | Reference | Comment |
---|---|---|---|
10.6 | PIPECO | Kuhn, Maier, et al., 1984 | LBLHLM |
10.71 ± 0.02 | PE | Bieri, Heilbronner, et al., 1979 | LLK |

Vibrational and/or electronic energy levels

Data compiled by: Takehiko Shimanouchi
Symmetry: Cxν Symmetry Number σ = 1
Sym. | No | Approximate | Selected Freq. | Infrared | Raman | Comments | ||||
---|---|---|---|---|---|---|---|---|---|---|
Species | type of mode | Value | Rating | Value | Phase | Value | Phase | |||
σ+ | 1 | CN str | 2292 | C | 2292 VS | gas | 2276 VS p | solid solid | ||
σ+ | 2 | C≡C str | 2150 | C | 2150 S | gas | 2123 W | solid solid | ||
σ+ | 3 | C-C str | 1054 | B | 1054 VW | gas | 1052 W | solid solid | ||
σ+ | 4 | CBr str | 419 | B | 419 W | gas | 418 M p | solid solid | ||
π | 5 | CCN bend | 485 | B | 485 S | gas | 489 S | solid solid | ||
π | 6 | CCC bend | 312 | B | 312 M | gas | 317 S | solid solid | ||
π | 7 | CCBr bend | 142 | D | 142 VW | solid solid | ||||
Source: Shimanouchi, 1972

References

Kuhn, Maier, et al., 1984
Kuhn, R.; Maier, J.P.; Thommen, F.,
Photoelectron-photoion coincidence studies of the A and B excited electronic states of X-C≡C-C≡CN+, X = CH3, CD3, Cl, Br, I,
J. Electron Spectrosc. Relat. Phenom., 1984, 34, 253. [all data]
Bieri, Heilbronner, et al., 1979
Bieri, G.; Heilbronner, E.; Hornung, V.; Kloster-Jensen, E.; Maier, J.P.; Thommen, F.; von Niessen, W.,
Electronic states of substituted haloacetylene and cyanoacetylene radical cations,
Chem. Phys., 1979, 36, 1. [all data]
Shimanouchi, 1972
Shimanouchi, T.,
Tables of Molecular Vibrational Frequencies Consolidated Volume II,
J. Phys. Chem. Ref. Data, 1972, 6, 3, 993-1102. [all data]