BH2CN
- Formula: CH2BN
- Molecular weight: 38.844
- CAS Registry Number: 31139-16-9

Reaction thermochemistry data

Data compiled by: John E. Bartmess
Individual Reactions
By formula: H- + CH2BN = (H- • CH2BN)
Quantity | Value | Units | Method | Reference | Comment |
---|---|---|---|---|---|
ΔrH° | 112.5 | kJ/mol | N/A | Workman and Squires, 1988 | gas phase; Calculated from data on BH3..CN- |

Ion clustering data

Data compiled by: John E. Bartmess
Clustering reactions
By formula: H- + CH2BN = (H- • CH2BN)
Quantity | Value | Units | Method | Reference | Comment |
---|---|---|---|---|---|
ΔrH° | 112.5 | kJ/mol | N/A | Workman and Squires, 1988 | gas phase; Calculated from data on BH3..CN- |

Vibrational and/or electronic energy levels

Data compiled by: Marilyn E. Jacox
State: X
Vib. sym. |
No. | Approximate type of mode |
cm-1 | Med. | Method | References | |
---|---|---|---|---|---|---|---|
CN stretch | 2092.2 | Ar | IR | Lanzisera and Andrews, 1997 | |||
Additional references: Jacox, 2003, page 262

References

Workman and Squires, 1988
Workman, D.B.; Squires, R.R.,
Hydride Binding Energies of Boranes,
Inorg. Chem., 1988, 27, 11, 1846, https://doi.org/10.1021/ic00284a003
. [all data]
Lanzisera and Andrews, 1997
Lanzisera, D.V.; Andrews, L.,
Reactions of Laser-Ablated Boron Atoms with Methylamines. Matrix Infrared Spectra and MP2 Frequency Calculations for Isotopic Product Molecules,
J. Phys. Chem. A, 1997, 101, 5, 824, https://doi.org/10.1021/jp962772g
. [all data]
Jacox, 2003
Jacox, M.E.,
Vibrational and electronic energy levels of polyatomic transient molecules: supplement B,
J. Phys. Chem. Ref. Data, 2003, 32, 1, 1-441, https://doi.org/10.1063/1.1497629
. [all data]