Sulfone, methyl phenyl
- Formula: C7H8O2S
- Molecular weight: 156.202
- IUPAC Standard InChIKey: JCDWETOKTFWTHA-UHFFFAOYSA-N
- CAS Registry Number: 3112-85-4
- Chemical structure:
View 3d structure (requires JavaScript / HTML 5) - Other names: Benzene, (methylsulfonyl)-; Methyl phenyl sulfone; Phenyl methyl sulfone; (Methylsulphonyl)benzene; Methyl phenyl sulphone; (Phenylsulfonyl)methane; (Methylsulfonyl)benzene; NSC 41587

Gas phase thermochemistry data

Data compiled by: Hussein Y. Afeefy, Joel F. Liebman, and Stephen E. Stein
Quantity | Value | Units | Method | Reference | Comment |
---|---|---|---|---|---|
ΔfH°gas | -253.4 ± 3.1 | kJ/mol | Ccr | Mackle and O'Hare, 1961 | Reanalyzed by Cox and Pilcher, 1970, Original value = -265. ± 3. kJ/mol; Hfusion=1.6±0.2 kcal/mol |

Condensed phase thermochemistry data

Data compiled by: Hussein Y. Afeefy, Joel F. Liebman, and Stephen E. Stein
Quantity | Value | Units | Method | Reference | Comment |
---|---|---|---|---|---|
ΔfH°liquid | -345.4 ± 0.88 | kJ/mol | Ccr | Mackle and O'Hare, 1961 | Reanalyzed by Cox and Pilcher, 1970, Original value = -349. ± 0.8 kJ/mol; Hfusion=1.6±0.2 kcal/mol |
Quantity | Value | Units | Method | Reference | Comment |
ΔcH°liquid | -4154.8 ± 0.67 | kJ/mol | Ccr | Mackle and O'Hare, 1961 | Reanalyzed by Cox and Pilcher, 1970, Original value = -4148.5 ± 0.4 kJ/mol; Hfusion=1.6±0.2 kcal/mol |

Phase change data

Data compiled by: Thermodynamics Research Center, NIST Boulder Laboratories, Chris Muzny director
Quantity | Value | Units | Method | Reference | Comment |
---|---|---|---|---|---|
Tfus | 358. | K | N/A | Kaldor and Hammond, 1991 | Uncertainty assigned by TRC = 2. K |
Tfus | 363. | K | N/A | Boehme and Sitorus, 1972 | Uncertainty assigned by TRC = 2. K |
Tfus | 360. | K | N/A | Challenger, Taylor, et al., 1942 | Uncertainty assigned by TRC = 3. K |
Tfus | 359. | K | N/A | Challenger, Taylor, et al., 1942 | Uncertainty assigned by TRC = 3. K |
Tfus | 361. | K | N/A | Challenger, Taylor, et al., 1942 | Uncertainty assigned by TRC = 3. K |

Reaction thermochemistry data

Data compiled as indicated in comments:
B - John E. Bartmess
RCD - Robert C. Dunbar
Individual Reactions
C7H7O2S- + =
By formula: C7H7O2S- + H+ = C7H8O2S
Quantity | Value | Units | Method | Reference | Comment |
---|---|---|---|---|---|
ΔrH° | 1518. ± 9.6 | kJ/mol | G+TS | Cumming and Kebarle, 1978 | gas phase; B |
Quantity | Value | Units | Method | Reference | Comment |
ΔrG° | 1487. ± 8.4 | kJ/mol | IMRE | Cumming and Kebarle, 1978 | gas phase; B |
By formula: Li+ + C7H8O2S = (Li+ • C7H8O2S)
Quantity | Value | Units | Method | Reference | Comment |
---|---|---|---|---|---|
ΔrH° | 213. | kJ/mol | CIDC | Buncel, Decouzon, et al., 1997 | RCD |

Gas phase ion energetics data

Data evaluated as indicated in comments:
HL - Edward P. Hunter and Sharon G. Lias
Data compiled as indicated in comments:
B - John E. Bartmess
LLK - Sharon G. Lias, Rhoda D. Levin, and Sherif A. Kafafi
Quantity | Value | Units | Method | Reference | Comment |
---|---|---|---|---|---|
Proton affinity (review) | 812.7 | kJ/mol | N/A | Hunter and Lias, 1998 | HL |
Quantity | Value | Units | Method | Reference | Comment |
Gas basicity | 780.3 | kJ/mol | N/A | Hunter and Lias, 1998 | HL |
Ionization energy determinations
IE (eV) | Method | Reference | Comment |
---|---|---|---|
9.5 | PE | Mohraz, Jian-qi, et al., 1981 | LLK |
9.85 | PE | Mohraz, Jian-qi, et al., 1981 | Vertical value; LLK |
9.74 | PE | Solouki, Bock, et al., 1975 | Vertical value; LLK |
De-protonation reactions
C7H7O2S- + =
By formula: C7H7O2S- + H+ = C7H8O2S
Quantity | Value | Units | Method | Reference | Comment |
---|---|---|---|---|---|
ΔrH° | 1518. ± 9.6 | kJ/mol | G+TS | Cumming and Kebarle, 1978 | gas phase; B |
Quantity | Value | Units | Method | Reference | Comment |
ΔrG° | 1487. ± 8.4 | kJ/mol | IMRE | Cumming and Kebarle, 1978 | gas phase; B |

Ion clustering data

Data compiled by: Robert C. Dunbar
Clustering reactions
By formula: Li+ + C7H8O2S = (Li+ • C7H8O2S)
Quantity | Value | Units | Method | Reference | Comment |
---|---|---|---|---|---|
ΔrH° | 213. | kJ/mol | CIDC | Buncel, Decouzon, et al., 1997 |

References

Mackle and O'Hare, 1961
Mackle, H.; O'Hare, P.A.G.,
Studies in the thermochemistry of sulphones. Part 6 - Heats of combustion, fusion, vaporization and atomization of six aromatic and two allylic sulphones,
Trans. Faraday Soc., 1961, 57, 1521-1526. [all data]
Cox and Pilcher, 1970
Cox, J.D.; Pilcher, G.,
Thermochemistry of Organic and Organometallic Compounds, Academic Press, New York, 1970, 1-636. [all data]
Kaldor and Hammond, 1991
Kaldor, S.W.; Hammond, M.,
A Mild Osmium Tetraoxide-Catalyzed Method for the Oxidation of Sulfides to Sulfones,
Tetrahedron Lett., 1991, 32, 5043-6. [all data]
Boehme and Sitorus, 1972
Boehme, V.H.; Sitorus, U.,
Oxidation of Thioethers to Sulfones with Hydrogen Peroxide in Alkaline Solution,
Chem.-Ztg., 1972, 96, 37-8. [all data]
Challenger, Taylor, et al., 1942
Challenger, F.; Taylor, P.; Taylor, B.,
Interaction of Betaine with Primary Aromatic Amines, Organic Disulfides, and Sodium Sulfate,
J. Chem. Soc., 1942, 48-55. [all data]
Cumming and Kebarle, 1978
Cumming, J.B.; Kebarle, P.,
Summary of gas phase measurements involving acids AH. Entropy changes in proton transfer reactions involving negative ions. Bond dissociation energies D(A-H) and electron affinities EA(A),
Can. J. Chem., 1978, 56, 1. [all data]
Buncel, Decouzon, et al., 1997
Buncel, E.; Decouzon, M.; Formento, A.; Gal, J.-F.; Herreros, M.; Li, L.; Maria, P.-C.,
Lithium-Cation and Proton Affinities of Sulfoxides and Sulfones: A Fourier Transform Ion Cyclotron Resonance Study,
J. Am. Soc. Mass Spectrom., 1997, 8, 3, 262, https://doi.org/10.1016/S1044-0305(96)00255-3
. [all data]
Hunter and Lias, 1998
Hunter, E.P.; Lias, S.G.,
Evaluated Gas Phase Basicities and Proton Affinities of Molecules: An Update,
J. Phys. Chem. Ref. Data, 1998, 27, 3, 413-656, https://doi.org/10.1063/1.556018
. [all data]
Mohraz, Jian-qi, et al., 1981
Mohraz, M.; Jian-qi, W.; Heilbronner, E.; Solladie-Cavallo, A.; Matloubi-Moghadam, F.,
11. Some comments on the conformations of methyl phenyl sulfides, sulfoxides and sulfones,
Helv. Chim. Acta, 1981, 64, 97. [all data]
Solouki, Bock, et al., 1975
Solouki, B.; Bock, H.; Appel, R.,
Photoelektronenspektren und Molekuleigenschaften, XLV Schwefelsaure-Derivate X2SY2: Alkyl-, Vinyl- und Arylsulfone, Alkylsulfoimide und Sulfurylhalogenide,
Chem. Ber., 1975, 108, 897. [all data]
Kloosterziel and Basker, 1953
Kloosterziel, H.; Basker, H.J.,
Rec. trav. chim., 1953, 72, 655. [all data]