Piperidine, tungsten pentacarbonyl
- Formula: C10H11NO5W
- Molecular weight: 409.04
- CAS Registry Number: 31082-68-5

Condensed phase thermochemistry data

Data compiled by: José A. Martinho Simões
Quantity | Value | Units | Method | Reference | Comment |
---|---|---|---|---|---|
ΔfH°solid | -921.6 ± 8.5 | kJ/mol | Review | Martinho Simões | The enthalpy of formation relies on -883.9 ± 2.7 kJ/mol for the enthalpy of formation of W(CO)6(g) |
ΔfH°solid | -918.8 | kJ/mol | Review | Martinho Simões | The enthalpy of formation relies on -960.3 ± 2.4 kJ/mol for the enthalpy of formation of W(CO)6(cr) |

Phase change data

Data compiled as indicated in comments:
MS - José A. Martinho Simões
AC - William E. Acree, Jr., James S. Chickos
Quantity | Value | Units | Method | Reference | Comment |
---|---|---|---|---|---|
ΔsubH° | 106.4 ± 1.0 | kJ/mol | DSC | Daamen, Ernsting, et al., 1979 | MS |
Enthalpy of sublimation
ΔsubH (kJ/mol) | Temperature (K) | Method | Reference | Comment |
---|---|---|---|---|
106.4 ± 1.0 | 308. | ME | Daamen, Ernsting, et al., 1979, 2 | Based on data from 289. to 327. K.; AC |

Gas phase ion energetics data

Data compiled as indicated in comments:
LLK - Sharon G. Lias, Rhoda D. Levin, and Sherif A. Kafafi
Ionization energy determinations
IE (eV) | Method | Reference | Comment |
---|---|---|---|
7.0 | PE | Daamen and Oskam, 1978 | LLK |
7.35 | PE | Daamen and Oskam, 1978 | Vertical value; LLK |

Gas phase thermochemistry data

Data compiled by: José A. Martinho Simões
Quantity | Value | Units | Method | Reference | Comment |
---|---|---|---|---|---|
ΔfH°gas | -815.2 ± 8.6 | kJ/mol | Review | Martinho Simões | The enthalpy of formation relies on -883.9 ± 2.7 kJ/mol for the enthalpy of formation of W(CO)6(g) |
ΔfH°gas | -812.4 | kJ/mol | Review | Martinho Simões | The enthalpy of formation relies on -960.3 ± 2.4 kJ/mol for the enthalpy of formation of W(CO)6(cr) |

References

Martinho Simões
Martinho Simões, J.A.,
Private communication (see http://webbook.nist.gov/chemistry/om/). [all data]
Daamen, Ernsting, et al., 1979
Daamen, H.; Ernsting, J.M.; Oskam, A.,
Thermochim. Acta, 1979, 33, 217. [all data]
Daamen, Ernsting, et al., 1979, 2
Daamen, H.; Ernsting, J.M.; Oskam, A.,
Vapour pressure measurements on M(CO)5L (M = Cr, Mo, W; L = piperidine, pyridine, pyrazine, pyrazole, thiazole),
Thermochimica Acta, 1979, 33, 217-223, https://doi.org/10.1016/0040-6031(79)87044-6
. [all data]
Daamen and Oskam, 1978
Daamen, H.; Oskam, A.,
Bonding properties of some monosubstituted chromium and tungsten hexacarbonyls M(CO)5L (L=amine, substituted pyridine, azine),
Inorg. Chim. Acta, 1978, 26, 81. [all data]