2,3,5,6-Tetramethyl-para-phenylenediamine
- Formula: C10H16N2
- Molecular weight: 164.2474
- IUPAC Standard InChIKey: WCZNKVPCIFMXEQ-UHFFFAOYSA-N
- CAS Registry Number: 3102-87-2
- Chemical structure:
View 3d structure (requires JavaScript / HTML 5) - Other names: 2,3,5,6-Tetramethyl-p-phenylenediamine; 1,4-Benzenediamine, 2,3,5,6-tetramethyl-

Phase change data

Data compiled by: Thermodynamics Research Center, NIST Boulder Laboratories, Chris Muzny director
Quantity | Value | Units | Method | Reference | Comment |
---|---|---|---|---|---|
Tfus | 422.15 | K | N/A | Smith and Dobrovolny, 1926 | Uncertainty assigned by TRC = 2. K |

Gas phase ion energetics data

Data compiled by: Sharon G. Lias, Rhoda D. Levin, and Sherif A. Kafafi
Ionization energy determinations
IE (eV) | Method | Reference |
---|---|---|
6.43 | PI | Pykhtina, Cherednichenko, et al., 1974 |
8.63 ± 0.03 | PI | Potapov, Kardash, et al., 1972 |

References

Smith and Dobrovolny, 1926
Smith, L.I.; Dobrovolny, F.J.,
Duroquinone and Some Derivatives of Durene,
J. Am. Chem. Soc., 1926, 48, 1420-23. [all data]
Pykhtina, Cherednichenko, et al., 1974
Pykhtina, E.V.; Cherednichenko, L.V.; Kardash, I.E.; Evlasheva, T.I.; Sorokin, V.V.; Potapov, V.K.; Pravednikov, A.N.,
Ionization potentials of amines and energies of charge transfer bands in the absorption spectra of complexes of 7,7,8,8-tetracyanoquinodimethan,
High Energy Chem., 1974, 8, 257, In original 307. [all data]
Potapov, Kardash, et al., 1972
Potapov, V.K.; Kardash, I.E.; Sorokin, V.V.; Sokolov, S.A.; Evlasheva, T.I.,
Photoionization of heteroaromatic compounds,
Khim. Vys. Energ., 1972, 6, 392. [all data]