Bicyclo[2.2.0]hex-2-ene
- Formula: C6H8
- Molecular weight: 80.1277
- IUPAC Standard InChIKey: WLDBDXRXMDBHHW-UHFFFAOYSA-N
- CAS Registry Number: 3097-63-0
- Chemical structure:
View 3d structure (requires JavaScript / HTML 5) - Permanent link for this species. Use this link for bookmarking this species for future reference.

Condensed phase thermochemistry data

Data compiled by: Hussein Y. Afeefy, Joel F. Liebman, and Stephen E. Stein
Quantity | Value | Units | Method | Reference | Comment |
---|---|---|---|---|---|
ΔfH°liquid | 261.1 | kJ/mol | Chyd | Roth, Adamczak, et al., 1991 |

Gas phase ion energetics data

Data compiled as indicated in comments:
LLK - Sharon G. Lias, Rhoda D. Levin, and Sherif A. Kafafi
Ionization energy determinations
IE (eV) | Method | Reference | Comment |
---|---|---|---|
9.0 ± 0.1 | PE | Bieri, Burger, et al., 1977 | LLK |
9.4 ± 0.1 | PE | Bieri, Burger, et al., 1977 | Vertical value; LLK |
9.4 | PE | Bieri, Heilbronner, et al., 1976 | Vertical value; LLK |

References

Roth, Adamczak, et al., 1991
Roth, W.R.; Adamczak, O.; Breuckmann, R.; Lennartz, H.-W.; Boese, R.,
Die Berechnung von Resonanzenergien; das MM2ERW-Kraftfeld,
Chem. Ber., 1991, 124, 2499-2521. [all data]
Bieri, Burger, et al., 1977
Bieri, G.; Burger, F.; Heilbronner, E.; Maier, J.P.,
Valence ionization enrgies of hydrocarbons,
Helv. Chim. Acta, 1977, 60, 2213. [all data]
Bieri, Heilbronner, et al., 1976
Bieri, G.; Heilbronner, E.; Kobayashi, T.; Schmelzer, A.; Goldstein, M.J.; Leight, R.S.; Lipton, M.S.,
286. Dewar benzene some of its derivatives. A photoelectron spectroscopic analysis,
Helv. Chim. Acta, 1976, 59, 2657. [all data]