1,4-Thiatellurin
- Formula: C4H4STe
- Molecular weight: 211.74
- IUPAC Standard InChIKey: WHOKCZDSPYDWQP-UHFFFAOYSA-N
- CAS Registry Number: 3092-46-4
- Chemical structure:
View 3d structure (requires JavaScript / HTML 5) - Permanent link for this species. Use this link for bookmarking this species for future reference.

Gas phase ion energetics data

Data compiled by: Sharon G. Lias, Rhoda D. Levin, and Sherif A. Kafafi
Ionization energy determinations
IE (eV) | Method | Reference | Comment |
---|---|---|---|
7.9 ± 0.1 | PE | Colonna, Distefano, et al., 1980 | Vertical value |

References

Colonna, Distefano, et al., 1980
Colonna, F.P.; Distefano, G.; Galasso, V.,
Photoelectron spectra of 1,4-dithiin and related compounds,
J. Electron Spectrosc. Relat. Phenom., 1980, 18, 75. [all data]