(E)-1-Chloro-2-fluoroethene
- Formula: C2HClF2
- Molecular weight: 98.479
- IUPAC Standard InChIKey: CJENPNUXCMYXPT-UPHRSURJSA-N
- CAS Registry Number: 30860-28-7
- Chemical structure:
View 3d structure (requires JavaScript / HTML 5) - Stereoisomers:

Reaction thermochemistry data

Data compiled by: Hussein Y. Afeefy, Joel F. Liebman, and Stephen E. Stein
Individual Reactions
By formula: C2HClF2 = C2HClF2
Quantity | Value | Units | Method | Reference | Comment |
---|---|---|---|---|---|
ΔrH° | 0.04 ± 0.67 | kJ/mol | Eqk | Craig, Evans, et al., 1970 | gas phase |

Gas phase ion energetics data

Data compiled by: Henry M. Rosenstock, Keith Draxl, Bruce W. Steiner, and John T. Herron
Ionization energy determinations
IE (eV) | Method | Reference |
---|---|---|
9.83 ± 0.02 | PI | Momigny, 1963 |

References

Craig, Evans, et al., 1970
Craig, N.C.; Evans, D.A.; Piper, L.G.; Wheeler, V.L.,
Vibrational assignments and thermodynamic functions for cis- and trans-1,2-difluoro-1-chloroethylenes,
J. Phys. Chem., 1970, 74, 4520-4527. [all data]
Momigny, 1963
Momigny, J.,
Ionization potentials and the structures of the photo-ionization yield curves of ethylene and its halogeno derivatives,
Nature, 1963, 199, 1179. [all data]