2,3-Dimethyl-2-heptene
- Formula: C9H18
- Molecular weight: 126.2392
- IUPAC Standard InChIKey: PTUNZAOKLBTUBF-UHFFFAOYSA-N
- CAS Registry Number: 3074-64-4
- Chemical structure:
View 3d structure (requires JavaScript / HTML 5) - Other names: n-C4H9C(CH3)=C(CH3)2; 2-Heptene, 2,3-dimethyl-

Phase change data

Data compiled by: Thermodynamics Research Center, NIST Boulder Laboratories, Chris Muzny director
Quantity | Value | Units | Method | Reference | Comment |
---|---|---|---|---|---|
Tboil | 418.3 | K | N/A | Cline, 1940 | Uncertainty assigned by TRC = 0.4 K |
Tboil | 419. | K | N/A | Horney and Smittenberg, 1937 | Uncertainty assigned by TRC = 2. K |
Quantity | Value | Units | Method | Reference | Comment |
Tfus | 164.7 | K | N/A | Cline, 1939 | Uncertainty assigned by TRC = 2. K |

Gas phase ion energetics data

Data compiled as indicated in comments:
LLK - Sharon G. Lias, Rhoda D. Levin, and Sherif A. Kafafi
Ionization energy determinations
IE (eV) | Method | Reference | Comment |
---|---|---|---|
8.145 ± 0.005 | PE | Masclet, Grosjean, et al., 1973 | LLK |

Kovats' RI, non-polar column, isothermal

Column type | Active phase | Temperature (C) | I | Reference | Comment |
---|---|---|---|---|---|
Capillary | OV-101 | 40. | 876. | Laub and Purnell, 1988 | |
Capillary | OV-101 | 60. | 878. | Laub and Purnell, 1988 | |
Capillary | OV-101 | 80. | 879. | Laub and Purnell, 1988 |

Normal alkane RI, non-polar column, temperature ramp

Column type | Active phase | I | Reference | Comment |
---|---|---|---|---|
Capillary | OV-101 | 877. | Orav, Kailas, et al., 1999 | 50. m/0.20 mm/0.50 μm, Helium, 30. C @ 6. min, 1. K/min; Tend: 100. C |

References

Cline, 1940
Cline, E.T.,
, PhD Thesis, 1940. [all data]
Horney and Smittenberg, 1937
Horney, A.G.; Smittenberg, J.,
Higher Type Olefins from Alkyl Substituted Bromoethylenes and Alkyl Halides by Means of Sodium or Magnesium and the Wurtz Reaction, Ph.D. Dissertation, Ohio State Univ., Columbus, 1937. [all data]
Cline, 1939
Cline, E.T.,
The Synthesis of Type III and Type V Olefins from Dimethylbutadien- monohydrobromide, Ph.D. Dissertation, Ohio State Univ., Columbus, OH, 1939. [all data]
Masclet, Grosjean, et al., 1973
Masclet, P.; Grosjean, D.; Mouvier, G.,
Alkene ionization potentials. Part I. Quantitative determination of alkyl group structural effects,
J. Electron Spectrosc. Relat. Phenom., 1973, 2, 225. [all data]
Laub and Purnell, 1988
Laub, R.J.; Purnell, J.H.,
Specific retention volumes, retention indices, and family-plot regressions of aliphatic, alicyclic, and aromatic hydrocarbon solutes with OV-101 poly (dimethylsiloxane) stationary phase,
J. Hi. Res. Chromatogr. Chromatogr. Comm., 1988, 11, 9, 649-660, https://doi.org/10.1002/jhrc.1240110908
. [all data]
Orav, Kailas, et al., 1999
Orav, A.; Kailas, T.; Muurisepp, M.; Kann, J.,
Composition of the oil from waste tires. 1. Fraction boiling at yp to 160 0C,
Proc. Estonian Acad. Sci. Chem., 1999, 48, 1, 30-39. [all data]