1-Propylcyclopentene
- Formula: C8H14
- Molecular weight: 110.1968
- IUPAC Standard InChIKey: FLWGCAJANMGQBB-UHFFFAOYSA-N
- CAS Registry Number: 3074-61-1
- Chemical structure:
View 3d structure (requires JavaScript / HTML 5) - Other names: Cyclopentene, 1-propyl-; 1-n-Propylcyclopentene; 1-Propyl-1-cyclopentene

Phase change data

Data compiled by: Thermodynamics Research Center, NIST Boulder Laboratories, Chris Muzny director
Quantity | Value | Units | Method | Reference | Comment |
---|---|---|---|---|---|
Tboil | 452. | K | N/A | Rinkes, 1938 | Uncertainty assigned by TRC = 4. K |
Tboil | 405.2 | K | N/A | Chavanne and Becker, 1927 | Uncertainty assigned by TRC = 2. K |
Tboil | 405. | K | N/A | Eisenlohr, 1925 | Uncertainty assigned by TRC = 3. K |
Quantity | Value | Units | Method | Reference | Comment |
Tfus | 172.9 | K | N/A | Timmermans, 1952 | Uncertainty assigned by TRC = 0.5 K |
Tfus | 172.9 | K | N/A | Chavanne and Becker, 1927 | Uncertainty assigned by TRC = 2. K |

Gas phase ion energetics data

Data compiled as indicated in comments:
LLK - Sharon G. Lias, Rhoda D. Levin, and Sherif A. Kafafi
Ionization energy determinations
IE (eV) | Method | Reference | Comment |
---|---|---|---|
8.48 ± 0.01 | PE | Rang, Paldoia, et al., 1974 | LLK |

Kovats' RI, non-polar column, isothermal

Column type | Active phase | Temperature (C) | I | Reference | Comment |
---|---|---|---|---|---|
Capillary | Squalane | 60. | 836. | Bogoslovsky, Anvaer, et al., 1978 | |
Capillary | Squalane | 70. | 839. | Bogoslovsky, Anvaer, et al., 1978 | |
Capillary | Squalane | 80. | 838. | Bogoslovsky, Anvaer, et al., 1978 | |
Capillary | Squalane | 86. | 841. | Bogoslovsky, Anvaer, et al., 1978 | |
Capillary | Squalane | 100. | 840. | Rang, Orav, et al., 1977 | Nitrogen or helium; Column length: 100. m; Column diameter: 0.25 mm |
Capillary | Squalane | 100. | 831. | Lulova, Leont'eva, et al., 1976 | He; Column length: 120. m; Column diameter: 0.25 mm |
Capillary | Squalane | 100. | 841. | Dielmann, Schwengers, et al., 1974 | Column length: 100. m; Column diameter: 0.25 mm |
Capillary | Squalane | 80. | 838. | Dielmann, Schwengers, et al., 1974 | Column length: 100. m; Column diameter: 0.25 mm |
Capillary | Apiezon L | 100. | 862. | Eisen, Orav, et al., 1972 | Column length: 45. m; Column diameter: 0.25 mm |
Capillary | Apiezon L | 120. | 868. | Eisen, Orav, et al., 1972 | Column length: 45. m; Column diameter: 0.25 mm |
Capillary | Squalane | 60. | 836.5 | Eisen, Orav, et al., 1972 | Column length: 80. m; Column diameter: 0.25 mm |
Capillary | Squalane | 80. | 839.2 | Eisen, Orav, et al., 1972 | Column length: 80. m; Column diameter: 0.25 mm |
Capillary | Squalane | 60. | 836. | Orav and Eisen, 1972 | Column length: 80. m; Column diameter: 0.25 mm |
Capillary | Squalane | 80. | 839. | Orav and Eisen, 1972 | Column length: 80. m; Column diameter: 0.25 mm |
Capillary | Squalane | 70. | 839. | Schomburg, 1966 |

Kovats' RI, polar column, isothermal

Column type | Active phase | Temperature (C) | I | Reference | Comment |
---|---|---|---|---|---|
Capillary | PEG 4000 | 100. | 972. | Rang, Orav, et al., 1988 | |
Capillary | PEG 4000 | 60. | 959. | Rang, Orav, et al., 1988 | |
Capillary | PEG 4000 | 80. | 966. | Rang, Orav, et al., 1988 | |
Capillary | PEG-20M | 100. | 961. | Rang, Orav, et al., 1988 | |
Capillary | PEG-20M | 110. | 965. | Rang, Orav, et al., 1988 | |
Capillary | PEG-20M | 120. | 968. | Rang, Orav, et al., 1988 | |
Capillary | PEG-20M | 80. | 954. | Rang, Orav, et al., 1988 | |
Capillary | PEG-20M | 90. | 958. | Rang, Orav, et al., 1988 | |
Capillary | PEG-20M | 100. | 961. | Orav, Kuningas, et al., 1982 | He; Column length: 100. m; Column diameter: 0.25 mm |
Capillary | PEG-20M | 110. | 964.9 | Orav, Kuningas, et al., 1982 | He; Column length: 100. m; Column diameter: 0.25 mm |
Capillary | PEG-20M | 120. | 968.1 | Orav, Kuningas, et al., 1982 | He; Column length: 100. m; Column diameter: 0.25 mm |
Capillary | PEG-20M | 80. | 954. | Orav, Kuningas, et al., 1982 | He; Column length: 100. m; Column diameter: 0.25 mm |
Capillary | PEG-20M | 90. | 958.4 | Orav, Kuningas, et al., 1982 | He; Column length: 100. m; Column diameter: 0.25 mm |
Capillary | PEG 4000 | 100. | 972. | Rang, Orav, et al., 1977 | Nitrogen or Helium; Column length: 45. m; Column diameter: 0.25 mm |
Capillary | Polyethylene Glycol 4000 | 100. | 972.1 | Eisen, Orav, et al., 1972 | Column length: 80. m; Column diameter: 0.25 mm |
Capillary | Polyethylene Glycol 4000 | 60. | 959.4 | Eisen, Orav, et al., 1972 | Column length: 80. m; Column diameter: 0.25 mm |
Capillary | Polyethylene Glycol 4000 | 80. | 966.4 | Eisen, Orav, et al., 1972 | Column length: 80. m; Column diameter: 0.25 mm |
Capillary | PEG 4000 | 100. | 972.1 | Orav and Eisen, 1972 | Column length: 80. m; Column diameter: 0.25 mm |
Capillary | PEG 4000 | 60. | 959.4 | Orav and Eisen, 1972 | Column length: 80. m; Column diameter: 0.25 mm |
Capillary | PEG 4000 | 80. | 966.4 | Orav and Eisen, 1972 | Column length: 80. m; Column diameter: 0.25 mm |

Normal alkane RI, non-polar column, custom temperature program

Column type | Active phase | I | Reference | Comment |
---|---|---|---|---|
Capillary | Squalane | 836. | Chen, 2008 | Program: not specified |

References

Rinkes, 1938
Rinkes, I.J.,
Recl. Trav. Chim. Pays-Bas, 1938, 57, 176. [all data]
Chavanne and Becker, 1927
Chavanne, G.; Becker, P.,
Bull. Soc. Chim. Belg., 1927, 36, 591. [all data]
Eisenlohr, 1925
Eisenlohr, F.,
Fortschr. Chem., Phys. Phys. Chem., 1925, 18, 1. [all data]
Timmermans, 1952
Timmermans, J.,
Freezing points of organic compounds. VVI New determinations.,
Bull. Soc. Chim. Belg., 1952, 61, 393. [all data]
Rang, Paldoia, et al., 1974
Rang, S.; Paldoia, P.; Talvari, A.,
Ionization potentials of unsaturated hydrocarbons. 2. Mono-substituted cyclopentenes and cyclohexenes,
Eesti. NSV Tead. Akad. Toim., 1974, 354. [all data]
Bogoslovsky, Anvaer, et al., 1978
Bogoslovsky, Yu.N.; Anvaer, B.I.; Vigdergauz, M.S.,
Chromatographic constants in gas chromatography (in Russian), Standards Publ. House, Moscow, 1978, 192. [all data]
Rang, Orav, et al., 1977
Rang, S.; Orav, A.; Kuningas, K.; Eisen, O.,
Capillary Gas Chromatography of Monosubstituted Cyclopentenes and Cyclohexenes,
Chromatographia, 1977, 10, 3, 115-122, https://doi.org/10.1007/BF02297862
. [all data]
Lulova, Leont'eva, et al., 1976
Lulova, N.I.; Leont'eva, S.A.; Timofeeva, A.N.,
Gas-chromatographic method of determination of individual hydrocarbons in catalytic cracking gasolines
in Proceedings of All-Union Research Institute on Oil Processes. Vol.18, All-Union Research Institute on Oil Processes, Moscow, 1976, 30-53. [all data]
Dielmann, Schwengers, et al., 1974
Dielmann, G.; Schwengers, D.; Schomburg, G.,
Gas-chromatographische Retentionsdaten und Strukture chemischer Verbindungen Gesättigte und ungesättigte alkylsubstituierte Cyclopentane und Methylcyclopentane,
Chromatographia, 1974, 7, 5, 215-224, https://doi.org/10.1007/BF02321771
. [all data]
Eisen, Orav, et al., 1972
Eisen, O.; Orav, A.; Rang, S.,
Identifizierung von Normal-Alkenen, Cyclopentenen und -Hexenen mittels Kapillar-Gas-Chromatographie. Identification des alcènes, cyclopentènes et -hexènes à l'aide de la chromatogrpahie en phase gazeuse sur colonne capillaire,
Chromatographia, 1972, 5, 11, 229-239, https://doi.org/10.1007/BF02270600
. [all data]
Orav and Eisen, 1972
Orav, A.; Eisen, O.,
The retention indexes for alkenes, alkynes and cyclenes on capillary columns,
Izv. Akad. Nauk Est. SSR, Khim. Geol., 1972, 21, 1, 39-47. [all data]
Schomburg, 1966
Schomburg, G.,
Gaschromatographische Retentionsdaten und struktur chemischer verbindungen. III. Alkylverzweigte und ungesättigte cyclische Kohlenwasserstoffe,
J. Chromatogr., 1966, 23, 18-41, https://doi.org/10.1016/S0021-9673(01)98653-4
. [all data]
Rang, Orav, et al., 1988
Rang, S.A.; Orav, A.E.; Kuningas, K.R.; Meister, A.E.; Strense, T.V.; Eisen, O.G.,
Gas-Chromatographic Characteristics of unsaturated hydrocarbons, Academy of Sciences of Estonia SSR, Tallinn, Estonia SSR, 1988, 208. [all data]
Orav, Kuningas, et al., 1982
Orav, A.; Kuningas, K.; Rang, S.; Eisen, O.,
Capillary gas chromatography of monosubstituted cyclopentenes and cyclohexenes C8-C15 on polyethylene glycol 20M,
Eesti NSV Tead. Akad. Toim. Keem., 1982, 40-49. [all data]
Chen, 2008
Chen, H.-F.,
Quantitative prediction of gas chromatography retention indices with support vector machines, radial basis neutral networks and multiple linear regression,
Anal. Chim. Acta, 2008, 609, 1, 24-36, https://doi.org/10.1016/j.aca.2008.01.003
. [all data]