6b,8a-Dihydrocyclobut[a]acenaphthylene
- Formula: C14H10
- Molecular weight: 178.2292
- IUPAC Standard InChIKey: MKRSLSRLZZVPKE-UHFFFAOYSA-N
- CAS Registry Number: 30736-79-9
- Chemical structure:
View 3d structure (requires JavaScript / HTML 5) - Permanent link for this species. Use this link for bookmarking this species for future reference.

Gas phase ion energetics data

Data compiled by: Sharon G. Lias, Rhoda D. Levin, and Sherif A. Kafafi
Ionization energy determinations
IE (eV) | Method | Reference | Comment |
---|---|---|---|
7.72 | PE | Gleiter, Haider, et al., 1979 | Vertical value |

References

Gleiter, Haider, et al., 1979
Gleiter, R.; Haider, R.; Murata, I.; Pagni, R.M.,
Photoelectron spectra of three isomeric (C14H10) naphtho[1,8]-fused hydrocarbons,
J. Chem. Res. Synop., 1979, 72. [all data]