1,1':4',1'':4'',1''':4''',1''''-Quinquephenyl
- Formula: C30H22
- Molecular weight: 382.4957
- IUPAC Standard InChIKey: OMCUOJTVNIHQTI-UHFFFAOYSA-N
- CAS Registry Number: 3073-05-0
- Chemical structure:
View 3d structure (requires JavaScript / HTML 5) - Other names: p-Quinquephenyl; p-Pentaphenyl; p-Quinquiphenyl

Phase change data

Data compiled as indicated in comments:
TRC - Thermodynamics Research Center, NIST Boulder Laboratories, Chris Muzny director
DH - Eugene S. Domalski and Elizabeth D. Hearing
Quantity | Value | Units | Method | Reference | Comment |
---|---|---|---|---|---|
Tfus | 645. | K | N/A | Vdovtsova and Tsukervanik, 1954 | Uncertainty assigned by TRC = 6. K; TRC |
Enthalpy of fusion
ΔfusH (kJ/mol) | Temperature (K) | Reference | Comment |
---|---|---|---|
42.300 | 659.6 | Smith, 1979 | Solid-nematic phase change.; DH |
Entropy of fusion
ΔfusS (J/mol*K) | Temperature (K) | Reference | Comment |
---|---|---|---|
64.1 | 659.6 | Smith, 1979 | Solid-nematic; DH |
Enthalpy of phase transition
ΔHtrs (kJ/mol) | Temperature (K) | Initial Phase | Final Phase | Reference | Comment |
---|---|---|---|---|---|
0.922 | 688.1 | liquid | liquid | Smith, 1979 | DH |
Entropy of phase transition
ΔStrs (J/mol*K) | Temperature (K) | Initial Phase | Final Phase | Reference | Comment |
---|---|---|---|---|---|
1.34 | 688.1 | liquid, Nematic | liquid, isotropic phase change | Smith, 1979 | DH |

Gas phase ion energetics data

Data compiled by: Henry M. Rosenstock, Keith Draxl, Bruce W. Steiner, and John T. Herron
Ionization energy determinations
IE (eV) | Method | Reference |
---|---|---|
8.18 ± 0.05 | EI | Gallegos, 1967 |

References

Vdovtsova and Tsukervanik, 1954
Vdovtsova, E.A.; Tsukervanik, I.P.,
Condensation of Phenylaluminum Diiodide with Aromatic Halogen Compounds,
Zh. Obshch. Khim., 1954, 24, 558. [all data]
Smith, 1979
Smith, G.W.,
Phase behavior of some linear polyphenyls,
Mol. Cryst. Liq. Cryst., 1979, 49, 207-209. [all data]
Gallegos, 1967
Gallegos, E.J.,
Mass spectrometry of some polyphenyls,
J. Phys. Chem., 1967, 71, 1647. [all data]
Clar, 1948
Clar, E.,
Chem. Ber., 1948, 81, 52. [all data]