1-cyanovinyl acetate
- Formula: C5H5NO2
- Molecular weight: 111.0987
- IUPAC Standard InChIKey: LFSHREXVLSTLFB-UHFFFAOYSA-N
- CAS Registry Number: 3061-65-2
- Chemical structure:
View 3d structure (requires JavaScript / HTML 5) - Permanent link for this species. Use this link for bookmarking this species for future reference.

Phase change data

Data compiled by: Robert L. Brown and Stephen E. Stein
Reduced pressure boiling point
Tboil (K) | Pressure (bar) | Reference |
---|---|---|
354.2 | 0.040 | Aldrich Chemical Company Inc., 1990 |

Gas phase ion energetics data

Data compiled by: Sharon G. Lias, Rhoda D. Levin, and Sherif A. Kafafi
Ionization energy determinations
IE (eV) | Method | Reference | Comment |
---|---|---|---|
10.76 ± 0.05 | PE | Houk and Munchausen, 1976 | Vertical value |

References

Aldrich Chemical Company Inc., 1990
Aldrich Chemical Company Inc.,
Catalog Handbook of Fine Chemicals, Aldrich Chemical Company, Inc., Milwaukee WI, 1990, 1. [all data]
Houk and Munchausen, 1976
Houk, K.N.; Munchausen, L.L.,
Ionization potentials, electron affinities, reactivities of cyanoalkenes related electron-deficient alkenes. A frontier molecular orbital treatment of cyanoalkene reactivities in cycloaddition, electrophilic, nucleophilic, and radical reactions.,
J. Am. Chem. Soc., 1976, 98, 937. [all data]