Benzonitrile,4-(1-oxopentyl)-
- Formula: C12H13NO
- Molecular weight: 187.2377
- IUPAC Standard InChIKey: SNDVNNGWNNDYHH-UHFFFAOYSA-N
- CAS Registry Number: 30611-20-2
- Chemical structure:
View 3d structure (requires JavaScript / HTML 5) - Permanent link for this species. Use this link for bookmarking this species for future reference.

Gas phase ion energetics data

Data compiled by: Sharon G. Lias, Rhoda D. Levin, and Sherif A. Kafafi
Ionization energy determinations
IE (eV) | Method | Reference | Comment |
---|---|---|---|
9.57 | PE | Koenig, Wielesek, et al., 1977 | Vertical value |

References

Koenig, Wielesek, et al., 1977
Koenig, T.; Wielesek, R.; Miller, L.L.; So, Y.-H.,
Correlation of electrochemical reactivity and photoelectron spectra of aromatic ketones,
J. Am. Chem. Soc., 1977, 99, 7061. [all data]