Benzonitrile, 4-iodo-
- Formula: C7H4IN
- Molecular weight: 229.0178
- IUPAC Standard InChIKey: XOKDXPVXJWTSRM-UHFFFAOYSA-N
- CAS Registry Number: 3058-39-7
- Chemical structure:
View 3d structure (requires JavaScript / HTML 5) - Other names: Benzonitrile, p-iodo-; p-Cyanoiodobenzene; p-Iodobenzonitrile; 4-Iodobenzonitrile

Gas phase ion energetics data

Data compiled by: Sharon G. Lias, Rhoda D. Levin, and Sherif A. Kafafi
Ionization energy determinations
IE (eV) | Method | Reference |
---|---|---|
9.13 | PE | Behan, Johnstone, et al., 1976 |

References

Behan, Johnstone, et al., 1976
Behan, J.M.; Johnstone, R.A.W.; Bentley, T.W.,
An evaluation of empirical methods for calculating the ionization potentials of substituted benzenes,
Org. Mass Spectrom., 1976, 11, 207. [all data]