1H-Indene, 3a,4,7,7a-tetrahydro-
- Formula: C9H12
- Molecular weight: 120.1916
- IUPAC Standard InChIKey: UFERIGCCDYCZLN-UHFFFAOYSA-N
- CAS Registry Number: 3048-65-5
- Chemical structure:
View 3d structure (requires JavaScript / HTML 5) - Stereoisomers:
- Other names: Indene, 3a,4,7,7a-tetrahydro-; Bicyclo(4,3,0)nona-3,7-diene; 3a,4,7,7a-Tetrahydroindene; 3a,4,7,7a-Tetrahydro-1H-indene; 4,7,8,9-Tetrahydroindene; Tetrahydroindene; Bicyclo[4.3.0]nona-3,7-diene

Phase change data

Data compiled by: William E. Acree, Jr., James S. Chickos
Enthalpy of vaporization
ΔvapH (kJ/mol) | Temperature (K) | Method | Reference | Comment |
---|---|---|---|---|
42.3 | 353. | A | Stephenson and Malanowski, 1987 | Based on data from 338. to 440. K. |

Gas phase ion energetics data

Data compiled by: Henry M. Rosenstock, Keith Draxl, Bruce W. Steiner, and John T. Herron
Ionization energy determinations
IE (eV) | Method | Reference |
---|---|---|
8.78 | PE | Bodor, Dewar, et al., 1970 |

Normal alkane RI, non-polar column, custom temperature program

Column type | Active phase | I | Reference | Comment |
---|---|---|---|---|
Capillary | OV-101 | 952. | Zenkevich, 1998 | He; Column length: 25. m; Column diameter: 0.20 mm; Program: not specified |

References

Stephenson and Malanowski, 1987
Stephenson, Richard M.; Malanowski, Stanislaw,
Handbook of the Thermodynamics of Organic Compounds, 1987, https://doi.org/10.1007/978-94-009-3173-2
. [all data]
Bodor, Dewar, et al., 1970
Bodor, N.; Dewar, M.J.S.; Worley, S.D.,
Photoelectron spectra of molecules. III. Ionization potentials of some cyclic hydrocarbons and their derivatives, and heats of formation and ionization potentials calculated by the MINDO SCF MO method,
J. Am. Chem. Soc., 1970, 92, 19. [all data]
Zenkevich, 1998
Zenkevich, I.G.,
Application of Methods of Molecular Dynamics in Chromato-Spectral Identification of ISomeric Products of Organic reactions (in Russian),
Zh. Org. Khim., 1998, 34, 10, 1463-1470. [all data]