2-Butanone, 3-methyl-3-nitroso-, dimer
- Formula: C10H18N2O4
- Molecular weight: 230.2609
- IUPAC Standard InChIKey: OESDVLGRNFMZSQ-UHFFFAOYSA-N
- CAS Registry Number: 30442-79-6
- Chemical structure:
View 3d structure (requires JavaScript / HTML 5) - Permanent link for this species. Use this link for bookmarking this species for future reference.

Gas phase ion energetics data

Data compiled by: Sharon G. Lias, Rhoda D. Levin, and Sherif A. Kafafi
Appearance energy determinations
Ion | AE (eV) | Other Products | Method | Reference | Comment |
---|---|---|---|---|---|
CH3+ | 15.70 | ? | EI | Day, Gowenlock, et al., 1978 | |
C2H3O+ | 11.60 | ? | EI | Day, Gowenlock, et al., 1978 | |
NO+ | 10.50 | ? | EI | Day, Gowenlock, et al., 1978 |

References

Day, Gowenlock, et al., 1978
Day, J.S.; Gowenlock, B.G.; Johnson, C.A.F.; McInally, I.D.; Pfab, J.,
Appearance potential studies of some geminal substituted C-nitroso- compounds,
J. Chem. Soc. Perkin Trans. 2, 1978, 10, 1110. [all data]