2,3-Pentadiene, 2-methyl-
- Formula: C6H10
- Molecular weight: 82.1436
- IUPAC Standard InChIKey: JWMDOGMKTRMFDS-UHFFFAOYSA-N
- CAS Registry Number: 3043-33-2
- Chemical structure:
View 3d structure (requires JavaScript / HTML 5) - Permanent link for this species. Use this link for bookmarking this species for future reference.

Phase change data

Data compiled by: Thermodynamics Research Center, NIST Boulder Laboratories, Chris Muzny director
Quantity | Value | Units | Method | Reference | Comment |
---|---|---|---|---|---|
Tboil | 344. | K | N/A | Slobodin, 1953 | Uncertainty assigned by TRC = 3. K |

Gas phase ion energetics data

Data compiled as indicated in comments:
LLK - Sharon G. Lias, Rhoda D. Levin, and Sherif A. Kafafi
Ionization energy determinations
IE (eV) | Method | Reference | Comment |
---|---|---|---|
8.64 ± 0.05 | EI | Wolkoff, Holmes, et al., 1980 | LLK |
8.69 | PE | Brogli, Crandall, et al., 1973 | Vertical value; LLK |
Appearance energy determinations
Ion | AE (eV) | Other Products | Method | Reference | Comment |
---|---|---|---|---|---|
C5H7+ | 9.55 ± 0.05 | CH3 | EI | Wolkoff, Holmes, et al., 1980 | LLK |

References

Slobodin, 1953
Slobodin, Ya.M.,
Sb. Statei Obshch. Khim., 1953, 2, 841. [all data]
Wolkoff, Holmes, et al., 1980
Wolkoff, P.; Holmes, J.L.; Lossing, F.P.,
On the formation of cyclopentenium cations from all C6H10+ molecular ion structures,
Can. J. Chem., 1980, 58, 251. [all data]
Brogli, Crandall, et al., 1973
Brogli, F.; Crandall, J.K.; Heilbronner, E.; Kloster-Jensen, E.; Sojka, S.A.,
The photoelectron spectra of methyl-substituted allenes and of tetramethyl-bisallenyl,
J. Electron Spectrosc. Relat. Phenom., 1973, 2, 455. [all data]