Harmaline
- Formula: C13H14N2O
- Molecular weight: 214.2631
- IUPAC Standard InChIKey: RERZNCLIYCABFS-UHFFFAOYSA-N
- CAS Registry Number: 304-21-2
- Chemical structure:
View 3d structure (requires JavaScript / HTML 5) - Other names: 3H-Pyrido[3,4-b]indole, 4,9-dihydro-7-methoxy-1-methyl-; Harmidine; 3,4-Dihydroharmine; Armalin; Dihydroharmine; Harmine, dihydro-; 1-Methyl-7-methoxy-3,4-dihydro-β-carboline; 3,4-Dihydro-7-methoxy-1-methyl-9H-pyrid[3,4-b]indole; 4,9-Dihydro-7-methoxy-1-methyl-3H-pyrido(3,4-b)indole; Harmalol methyl ether; O-Methylharmalol; NSC 407285; 3,4-Dihydro-7-methoxy-1-methyl-9-pyrid(3,4-b)indole; 7-Methoxy-1-methyl-4,9-dihydro-3H-beta-carboline

Gas phase ion energetics data

Data compiled by: Sharon G. Lias, Rhoda D. Levin, and Sherif A. Kafafi
Ionization energy determinations
IE (eV) | Method | Reference | Comment |
---|---|---|---|
7.38 ± 0.06 | PE | Domelsmith and Houk, 1978 | Vertical value |

Van Den Dool and Kratz RI, non-polar column, custom temperature program

View large format table.

Column type Active phase I Reference Comment
CapillaryVF-5MS2266.Tret'yakov, 200830. m/0.25 mm/0.25 μm, He; Program: Multi-step temperature program; T(initial)=60C; T(final)=270C

References

Domelsmith and Houk, 1978
Domelsmith, L.N.; Houk, K.N.,
Photoelectron spectroscopic studies of hallucinogens: The use of ionization potentials in QSAR,
NIDA Res. Monogr., 1978, 22, 423. [all data]