Tetraethyldiphosphine
- Formula: C8H20P2
- Molecular weight: 178.1919
- IUPAC Standard InChIKey: UVTLTCJBYXBVBA-UHFFFAOYSA-N
- CAS Registry Number: 3040-63-9
- Chemical structure:
View 3d structure (requires JavaScript / HTML 5) - Permanent link for this species. Use this link for bookmarking this species for future reference.

Gas phase ion energetics data

Data compiled by: Henry M. Rosenstock, Keith Draxl, Bruce W. Steiner, and John T. Herron
Ionization energy determinations
IE (eV) | Method | Reference |
---|---|---|
7.8 | EI | Bogolyubov, Grishin, et al., 1969 |
7.8 ± 0.3 | EI | Bogolyubov, Grishin, et al., 1969 |
Appearance energy determinations

References

Bogolyubov, Grishin, et al., 1969
Bogolyubov, G.M.; Grishin, N.N.; Petrov, A.A.,
Organic derivatives of group V and group VI elements. VIII.Mass spectra of phosphines and diphosphines,
Zh. Obshch. Khim., 1969, 39, 1808, In original 1772. [all data]
Grishin, Bogolyubov, et al., 1968
Grishin, N.N.; Bogolyubov, G.M.; Petrov, A.A.,
Compounds containing P-P bonds. IV.Massspectrometric investigation of phosphines. P-P bond energy in diphosphines,
Zh. Obshch. Khim., 1968, 38, 2683, In original 2595. [all data]