Tetracyclo[5.2.1.02,6.03,5]dec-8-ene
- Formula: C10H12
- Molecular weight: 132.2023
- IUPAC Standard InChIKey: BZFDZVNRTHWGDO-UHFFFAOYSA-N
- CAS Registry Number: 30358-36-2
- Chemical structure:
View 3d structure (requires JavaScript / HTML 5) - Permanent link for this species. Use this link for bookmarking this species for future reference.

Reaction thermochemistry data

Data compiled by: Hussein Y. Afeefy, Joel F. Liebman, and Stephen E. Stein
Individual Reactions
By formula: 2H2 + C10H12 = C10H16
Quantity | Value | Units | Method | Reference | Comment |
---|---|---|---|---|---|
ΔrH° | -363. ± 1. | kJ/mol | Chyd | Roth, Klarner, et al., 1980 | liquid phase; solvent: Cyclohexane |

Gas phase ion energetics data

Data compiled as indicated in comments:
LLK - Sharon G. Lias, Rhoda D. Levin, and Sherif A. Kafafi
Ionization energy determinations
IE (eV) | Method | Reference | Comment |
---|---|---|---|
8.83 ± 0.03 | PE | Martin, Kagabu, et al., 1974 | Vertical value; LLK |

References

Roth, Klarner, et al., 1980
Roth, W.R.; Klarner, F.-G.; Lennartz, H.-W.,
Heats of hydrogenation. II. Heat of hydrogenation of bicyclo[2.1.0]pent-2-ene, an antiaromatic system,
Chem. Ber., 1980, 113, 1806-1818. [all data]
Martin, Kagabu, et al., 1974
Martin, H.-D.; Kagabu, S.; Schwesinger, R.,
Photoelektronenspektroskopische untersuchung der intramolekularen π,π-wechselwirkungen in endo-tricyclo[4.2.1.02,5]- nonadienen. Homokonjugation mit cyclobutanen,
Chem. Ber., 1974, 107, 3130. [all data]