ethyl hydroperoxide
- Formula: C2H6O2
- Molecular weight: 62.0678
- IUPAC Standard InChIKey: ILHIHKRJJMKBEE-UHFFFAOYSA-N
- CAS Registry Number: 3031-74-1
- Chemical structure:
View 3d structure (requires JavaScript / HTML 5) - Permanent link for this species. Use this link for bookmarking this species for future reference.

Gas phase thermochemistry data

Data compiled as indicated in comments:
ALS - Hussein Y. Afeefy, Joel F. Liebman, and Stephen E. Stein
GT - Glushko Thermocenter, Russian Academy of Sciences, Moscow
Quantity | Value | Units | Method | Reference | Comment |
---|---|---|---|---|---|
ΔfH°gas | -210. | kJ/mol | Ccb | Stathis and Egerton, 1940 | ALS |
Constant pressure heat capacity of gas
Cp,gas (J/mol*K) | Temperature (K) | Reference | Comment |
---|---|---|---|
82.64 | 298.15 | Lay T.H., 1996 | Selected values were obtained by ab initio calculation.; GT |
82.80 | 300. | ||
100.12 | 400. | ||
115.85 | 500. | ||
129.20 | 600. | ||
150.12 | 800. | ||
165.44 | 1000. | ||
188.87 | 1500. |

Condensed phase thermochemistry data

Data compiled by: Hussein Y. Afeefy, Joel F. Liebman, and Stephen E. Stein
Quantity | Value | Units | Method | Reference | Comment |
---|---|---|---|---|---|
ΔcH°liquid | -1402.4 ± 0.84 | kJ/mol | Ccb | Stathis and Egerton, 1940 | Corresponding ΔfHºliquid = -242.2 kJ/mol (simple calculation by NIST; no Washburn corrections) |

Phase change data

Data compiled as indicated in comments:
AC - William E. Acree, Jr., James S. Chickos
ALS - Hussein Y. Afeefy, Joel F. Liebman, and Stephen E. Stein
Enthalpy of vaporization
ΔvapH (kJ/mol) | Temperature (K) | Method | Reference | Comment |
---|---|---|---|---|
64.0 | 268. | A | Stephenson and Malanowski, 1987 | Based on data from 253. to 363. K. See also Egerton, Emte, et al., 1951 and Dykyj, 1970.; AC |
42.635 | 253. | V | Egerton, Emte, et al., 1951 | ALS |

Reaction thermochemistry data

Data compiled by: John E. Bartmess
Individual Reactions
C2H5O2- + =
By formula: C2H5O2- + H+ = C2H6O2
Quantity | Value | Units | Method | Reference | Comment |
---|---|---|---|---|---|
ΔrH° | 1552. ± 8.8 | kJ/mol | G+TS | Blanksby, Ramond, et al., 2001 | gas phase |
Quantity | Value | Units | Method | Reference | Comment |
ΔrG° | 1523. ± 8.4 | kJ/mol | IMRE | Blanksby, Ramond, et al., 2001 | gas phase |

Henry's Law data

Data compiled by: Rolf Sander
Henry's Law constant (water solution)
kH(T) = k°H exp(d(ln(kH))/d(1/T) ((1/T) - 1/(298.15 K)))
k°H = Henry's law constant for solubility in water at 298.15 K (mol/(kg*bar))
d(ln(kH))/d(1/T) = Temperature dependence constant (K)
k°H (mol/(kg*bar)) | d(ln(kH))/d(1/T) (K) | Method | Reference |
---|---|---|---|
340. | 6000. | M | N/A |

Gas phase ion energetics data

Data compiled as indicated in comments:
B - John E. Bartmess
LBLHLM - Sharon G. Lias, John E. Bartmess, Joel F. Liebman, John L. Holmes, Rhoda D. Levin, and W. Gary Mallard
Appearance energy determinations
Ion | AE (eV) | Other Products | Method | Reference | Comment |
---|---|---|---|---|---|
CH3O2+ | 11.4 | CH3 | EI | Holmes, Mommers, et al., 1985 | LBLHLM |
De-protonation reactions
C2H5O2- + =
By formula: C2H5O2- + H+ = C2H6O2
Quantity | Value | Units | Method | Reference | Comment |
---|---|---|---|---|---|
ΔrH° | 1552. ± 8.8 | kJ/mol | G+TS | Blanksby, Ramond, et al., 2001 | gas phase; B |
Quantity | Value | Units | Method | Reference | Comment |
ΔrG° | 1523. ± 8.4 | kJ/mol | IMRE | Blanksby, Ramond, et al., 2001 | gas phase; B |

References

Stathis and Egerton, 1940
Stathis, E.C.; Egerton, A.C.,
Note on heats of formation of ethyl and propyl peroxides,
Trans. Faraday Soc., 1940, 36, 606. [all data]
Lay T.H., 1996
Lay T.H.,
Ab initio study of alpha-chlorinated ethyl hydroperoxides CH3CH2OOH, CH3CHClOOH, and CH3CCl2OOH: conformational analysis, internal rotation barriers, vibrational frequencies, and thermodynamic properties,
J. Phys. Chem., 1996, 100, 8240-8249. [all data]
Stephenson and Malanowski, 1987
Stephenson, Richard M.; Malanowski, Stanislaw,
Handbook of the Thermodynamics of Organic Compounds, 1987, https://doi.org/10.1007/978-94-009-3173-2
. [all data]
Egerton, Emte, et al., 1951
Egerton, A.C.; Emte, W.; Minkoff, G.J.,
Some properties of organic peroxides,
Faraday Discuss. Chem. Soc., 1951, 10, 278. [all data]
Dykyj, 1970
Dykyj, J.,
Petrochemica, 1970, 10, 2, 51. [all data]
Blanksby, Ramond, et al., 2001
Blanksby, S.J.; Ramond, T.M.; Davico, G.E.; Nimlos, M.R.; Kato, S.; Bierbaum, V.M.; Lineberger, W.C.; Ellison,
Negative-ion photoelectron spectroscopy, gas-phase acidity, and thermochemistry of the peroxyl radicals CH3OO and CH3CH2OO,
J. Am. Chem. Soc., 2001, 123, 39, 9585-9596, https://doi.org/10.1021/ja010942j
. [all data]
Holmes, Mommers, et al., 1985
Holmes, J.; Mommers, A.; DeKoster, C.; Heerma, W.; Terlouw, J.,
Four isomeric [C,H3,O2] ions,
Chem. Phys. Lett., 1985, 115, 437. [all data]