2-Butene, 2,3-dichloro-1,1,1,4,4,4-hexafluoro-
- Formula: C4Cl2F6
- Molecular weight: 232.939
- IUPAC Standard InChIKey: XDIDQEGAKCWQQP-OWOJBTEDSA-N
- CAS Registry Number: 303-04-8
- Chemical structure:
View 3d structure (requires JavaScript / HTML 5) - Other names: 2,3-Dichlorohexafluoro-2-butene; 2,3-Dichlorohexafluorobutene-2; 2-Butene, 2,3-dichlorohexafluoro-; Dchfb; 2,3-Dichloro-1,1,1,4,4,4-hexafluorobutene-2; trans-2,3-Dichloro-1,1,1,4,4,4-hexafluoro-2-butene; 2,3-dichlorohexafluorobut-2-ene

Phase change data

Data compiled by: Robert L. Brown and Stephen E. Stein
Quantity | Value | Units | Method | Reference | Comment |
---|---|---|---|---|---|
Tboil | 340.2 | K | N/A | Aldrich Chemical Company Inc., 1990 | |
Tboil | 341. to 342. | K | N/A | PCR Inc., 1990 |

Gas phase ion energetics data

Data compiled by: Henry M. Rosenstock, Keith Draxl, Bruce W. Steiner, and John T. Herron
Ionization energy determinations
IE (eV) | Method | Reference |
---|---|---|
10.36 ± 0.01 | PI | Watanabe, Nakayama, et al., 1962 |

References

Aldrich Chemical Company Inc., 1990
Aldrich Chemical Company Inc.,
Catalog Handbook of Fine Chemicals, Aldrich Chemical Company, Inc., Milwaukee WI, 1990, 1. [all data]
PCR Inc., 1990
PCR Inc.,
Research Chemicals Catalog 1990-1991, PCR Inc., Gainesville, FL, 1990, 1. [all data]
Watanabe, Nakayama, et al., 1962
Watanabe, K.; Nakayama, T.; Mottl, J.,
Ionization potentials of some molecules,
J. Quant. Spectry. Radiative Transfer, 1962, 2, 369. [all data]