Benzene,1,1'-(1,3,5,7,9-decapentaene-1,10-diyl)bis-
- Formula: C22H20
- Molecular weight: 284.3942
- IUPAC Standard InChIKey: NODIXMQDAGGDJQ-GDHZPREYSA-N
- CAS Registry Number: 3029-41-2
- Chemical structure:
View 3d structure (requires JavaScript / HTML 5) - Permanent link for this species. Use this link for bookmarking this species for future reference.

Gas phase ion energetics data

Data compiled as indicated in comments:
LLK - Sharon G. Lias, Rhoda D. Levin, and Sherif A. Kafafi
RDSH - Henry M. Rosenstock, Keith Draxl, Bruce W. Steiner, and John T. Herron
Ionization energy determinations
IE (eV) | Method | Reference | Comment |
---|---|---|---|
7.05 | PE | Hudson, Ridyard, et al., 1976 | LLK |
7.4 | DER | Briegleb and Czekalla, 1959 | RDSH |

References

Hudson, Ridyard, et al., 1976
Hudson, B.S.; Ridyard, J.N.A.; Diamond, J.,
Polyene spectroscopy. Photoelectron spectra of the diphenylpolyenes,
J. Am. Chem. Soc., 1976, 98, 1126. [all data]
Briegleb and Czekalla, 1959
Briegleb, G.; Czekalla, J.,
Die Bestimmung von lonisierungsenergien aus den Spektren von Elektronenubergangskomplexen,
Z.Elektrochem., 1959, 63, 6. [all data]